{"text_format":"3","workbook":"xlsx","n_sheets":8,"sheets":["OptionsUniques","Menu","CleanCombi","CombiTable","SpillACB","SpillFTL","SpillZTS","ZoneTypes"],"not_rendered":{"macros":1,"defined_names":1},"read":"whole","date_system":"1900"}

{"sheet":"OptionsUniques","index":0,"n_rows":322,"n_cols":12,"rows_kept":322,"hidden":true}
["Zone Application Type","Zone Type","Air Con / FCU Brand","Air Con Model","FCU Reference","UFH Type","UFH Zone Reference","Floor Finish (Optional)"," Floor Temperature Protection Limit Required","Floor Temperature Limit °C","Temperature to be Controlled","Zone Temp Sensor"]
["A","Heating + Air Con","Daikin",null,null,"WET UFH",null,null,"NO","N/A","Room Temp","Room Thimble Sensor"]
[null,null,"Mitsubishi",{"$nulls":8},"AC Unit"]
[null,null,"Toshiba",{"$nulls":8},"Wired Controller"]
[null,null,"Sanyo "]
[null,null,"Panasonic "]
[null,null,"Fujitsu "]
[null,null,"Hitachi "]
[null,null,"LG"]
[null,null,"Other"]
[]
["B","Heating + Air Con","Daikin",null,null,"WET UFH",null,null,"YES","TBA","Room Temp","Room Thimble Sensor"]
[null,null,"Mitsubishi",{"$nulls":6},"25 °C",null,"AC Unit"]
[null,null,"Toshiba",{"$nulls":6},"26 °C",null,"Wired Controller"]
[null,null,"Sanyo ",{"$nulls":6},"27 °C"]
{"$rows_left_out":308}
{"sheet":"Menu","index":1,"n_rows":132,"n_cols":11,"rows_kept":132,"hidden":true}
["Floor","UFH Manifold","UFH Zone","Zone Application Type","Zone Type","Air Con / FCU Brand","UFH Type"," Floor Temperature Protection Limit Required","Floor Temperature Limit °C","Temperature to be Controlled","Zone Temp Sensor"]
[]
["PLEASE SELECT","PLEASE SELECT","PLEASE SELECT","PLEASE SELECT","PLEASE SELECT","PLEASE SELECT","PLEASE SELECT","PLEASE SELECT","PLEASE SELECT","PLEASE SELECT","PLEASE SELECT"]
[]
["Basement","M1","1-1","A","Heating + Air Con","Daikin","WET UFH","YES","N/A","Room Temp","Room Thimble Sensor"]
["Lower Ground","M2","1-2","B","Heating + FCU","Mitsubishi","ELECTRIC UFH","NO","TBA","Floor Temp","ClimateSync Room Sensor"]
["Ground","M3","1-3","C","AC only","Toshiba","RADIATOR","N/A","25 °C","Cylinder Temp","Floor Probe"]
["1st","M4","1-4","D","FCU Only","Sanyo ","N/A",null,"26 °C","ON/OFF Only","AC Unit"]
["2nd","M5","1-5","E","Heating","Panasonic ",null,null,"27 °C",null,"FCU Unit"]
["3rd","M6","1-6","F","Towel Rad ON/OFF Only","Fujitsu ",null,null,"28 °C",null,"Wired Controller"]
["4th","M7","1-7","G","Towel Rad Temp Control","Hitachi ",null,null,"29 °C",null,"Cylinder Probe"]
["5th","M8","1-8","H","ON/OFF SWITCH","LG",null,null,"30 °C",null,"N/A"]
["6th","M9","2-1","I","Hot Water ON/OFF","Other",null,null,"31 °C"]
[null,"M10","2-2","J","Hot Water, Temp Control (Valve Only)","N/A",null,null,"32 °C"]
[null,null,"2-3","K","Hot Water, Temp Control (Valve & Boiler)",{"$nulls":3},"33 °C"]
{"$rows_left_out":118}
{"sheet":"CleanCombi","index":2,"n_rows":1826,"n_cols":18,"rows_kept":1826,"hidden":true}
["Zone Application Type","Zone Type","AC/FCU Brand","UFH Type","Floor Temperature Protection Limit Required","Floor Temperature Limit °C","Temperature to be Controlled","Zone Temp Sensor",null,null,"Static Uniques Per Column"]
["PLEASE SELECT","First Select Zone Application Type","First Select Zone Application Type","First Select Zone Application Type","First Select Zone Application Type","First Select Zone Application Type","First Select Zone Application Type","First Select Zone Application Type",null,null,"Zone Application Type","Zone Type","AC/FCU Brand","UFH Type","Floor Temperature Protection Limit Required","Floor Temperature Limit °C","Temperature to be Controlled","Zone Temp Sensor"]
["A","Heating + Air Con","PLEASE SELECT","WET UFH","NO","N/A","Room Temp","PLEASE SELECT",null,null,"PLEASE SELECT","First Select Zone Application Type","First Select Zone Application Type","First Select Zone Application Type","First Select Zone Application Type","First Select Zone Application Type","First Select Zone Application Type","First Select Zone Application Type"]
["B","Heating + Air Con","PLEASE SELECT","WET UFH","YES","PLEASE SELECT","Room Temp","PLEASE SELECT",null,null,"A","Heating + Air Con","PLEASE SELECT","WET UFH","NO","N/A","Room Temp","PLEASE SELECT"]
["C","Heating + Air Con","PLEASE SELECT","ELECTRIC UFH","NO","N/A","Room Temp","PLEASE SELECT",null,null,"B","AC only","N/A","ELECTRIC UFH","YES","PLEASE SELECT","Floor Temp","Floor Probe"]
["D","Heating + Air Con","PLEASE SELECT","ELECTRIC UFH","YES","PLEASE SELECT","Room Temp","PLEASE SELECT",null,null,"C","Heating","Daikin","RADIATOR","N/A","TBA","ON/OFF Only","N/A"]
["E","Heating + Air Con","PLEASE SELECT","RADIATOR","N/A","N/A","Room Temp","PLEASE SELECT",null,null,"D","ON/OFF SWITCH","Mitsubishi","N/A",null,"25 °C","Cylinder Temp","Cylinder Probe"]
["F","AC only","PLEASE SELECT","N/A","N/A","N/A","Room Temp","PLEASE SELECT",null,null,"E","Towel Rad ON/OFF Only","Toshiba",null,null,"26 °C",null,"Room Thimble Sensor"]
["G","Heating","N/A","WET UFH","NO","N/A","Room Temp","PLEASE SELECT",null,null,"F","Towel Rad Temp Control","Sanyo ",null,null,"27 °C",null,"AC Unit"]
["H","Heating","N/A","WET UFH","YES","PLEASE SELECT","Room Temp","PLEASE SELECT",null,null,"G","Hot Water ON/OFF","Panasonic ",null,null,"28 °C",null,"Wired Controller"]
["I","Heating","N/A","WET UFH","NO","N/A","Floor Temp","Floor Probe",null,null,"H","Hot Water, Temp Control (Valve Only)","Fujitsu ",null,null,"29 °C",null,"ClimateSync Room Sensor"]
["J","Heating","N/A","ELECTRIC UFH","NO","N/A","Room Temp","PLEASE SELECT",null,null,"I","Hot Water, Temp Control (Valve & Boiler)","Hitachi ",null,null,"30 °C"]
["K","Heating","N/A","ELECTRIC UFH","YES","PLEASE SELECT","Room Temp","PLEASE SELECT",null,null,"J","Heating + FCU","LG",null,null,"31 °C"]
["L","Heating","N/A","ELECTRIC UFH","NO","N/A","Floor Temp","Floor Probe",null,null,"K","FCU Only","Other",null,null,"32 °C"]
["M","Heating","N/A","RADIATOR","N/A","N/A","Room Temp","PLEASE SELECT",null,null,"L",{"$nulls":4},"33 °C"]
{"$rows_left_out":1812}
{"sheet":"CombiTable","index":3,"n_rows":1826,"n_cols":17,"rows_kept":1826,"hidden":true}
["Zone Application Type","Zone Type","AC/FCU Brand","UFH Type","Floor Temperature Protection Limit Required","Floor Temperature Limit °C","Temperature to be Controlled","Zone Temp Sensor",null,"Zone Application Type","Zone Type","AC/FCU Brand","UFH Type","Floor Temperature Protection Limit Required","Floor Temperature Limit °C","Temperature to be Controlled","Zone Temp Sensor"]
["PLEASE SELECT","First Select Zone Application Type","First Select Zone Application Type","First Select Zone Application Type","First Select Zone Application Type","First Select Zone Application Type","First Select Zone Application Type","First Select Zone Application Type",null,{"$f":"_xlfn.UNIQUE(ct_01[Zone Application Type])","v":"PLEASE SELECT"},{"$f":"_xlfn.UNIQUE(ct_01[Zone Type])","v":"First Select Zone Application Type"},{"$f":"_xlfn.UNIQUE(ct_01[AC/FCU Brand])","v":"First Select Zone Application Type"},{"$f":"_xlfn.UNIQUE(ct_01[UFH Type])","v":"First Select Zone Application Type"},{"$f":"_xlfn.UNIQUE(ct_01[Floor Temperature Protection Limit Required])","v":"First Select Zone Application Type"},{"$f":"_xlfn.UNIQUE(ct_01[Floor Temperature Limit °C])","v":"First Select Zone Application Type"},{"$f":"_xlfn.UNIQUE(ct_01[Temperature to be Controlled])","v":"First Select Zone Application Type"},{"$f":"_xlfn.UNIQUE(ct_01[Zone Temp Sensor])","v":"First Select Zone Application Type"}]
["A","Heating + Air Con","PLEASE SELECT","WET UFH","NO","N/A","Room Temp","PLEASE SELECT",null,"A","Heating + Air Con","PLEASE SELECT","WET UFH","NO","N/A","Room Temp","PLEASE SELECT"]
["B","Heating + Air Con","PLEASE SELECT","WET UFH","YES","PLEASE SELECT","Room Temp","PLEASE SELECT",null,"B","AC only","N/A","ELECTRIC UFH","YES","PLEASE SELECT","Floor Temp","Floor Probe"]
["C","Heating + Air Con","PLEASE SELECT","ELECTRIC UFH","NO","N/A","Room Temp","PLEASE SELECT",null,"C","Heating","Daikin","RADIATOR","N/A","TBA","ON/OFF Only","N/A"]
["D","Heating + Air Con","PLEASE SELECT","ELECTRIC UFH","YES","PLEASE SELECT","Room Temp","PLEASE SELECT",null,"D","ON/OFF SWITCH","Mitsubishi","N/A",null,"25 °C","Cylinder Temp","Cylinder Probe"]
["E","Heating + Air Con","PLEASE SELECT","RADIATOR","N/A","N/A","Room Temp","PLEASE SELECT",null,"E","Towel Rad ON/OFF Only","Toshiba",null,null,"26 °C",null,"Room Thimble Sensor"]
["F","AC only","PLEASE SELECT","N/A","N/A","N/A","Room Temp","PLEASE SELECT",null,"F","Towel Rad Temp Control","Sanyo ",null,null,"27 °C",null,"AC Unit"]
["G","Heating","N/A","WET UFH","NO","N/A","Room Temp","PLEASE SELECT",null,"G","Hot Water ON/OFF","Panasonic ",null,null,"28 °C",null,"Wired Controller"]
["H","Heating","N/A","WET UFH","YES","PLEASE SELECT","Room Temp","PLEASE SELECT",null,"H","Hot Water, Temp Control (Valve Only)","Fujitsu ",null,null,"29 °C",null,"ClimateSync Room Sensor"]
["I","Heating","N/A","WET UFH","NO","N/A","Floor Temp","Floor Probe",null,"I","Hot Water, Temp Control (Valve & Boiler)","Hitachi ",null,null,"30 °C"]
["J","Heating","N/A","ELECTRIC UFH","NO","N/A","Room Temp","PLEASE SELECT",null,"J","Heating + FCU","LG",null,null,"31 °C"]
["K","Heating","N/A","ELECTRIC UFH","YES","PLEASE SELECT","Room Temp","PLEASE SELECT",null,"K","FCU Only","Other",null,null,"32 °C"]
["L","Heating","N/A","ELECTRIC UFH","NO","N/A","Floor Temp","Floor Probe",null,"L",{"$nulls":4},"33 °C"]
["M","Heating","N/A","RADIATOR","N/A","N/A","Room Temp","PLEASE SELECT",null,"M",{"$nulls":4},"34 °C"]
{"$rows_left_out":1812}
{"sheet":"SpillACB","index":4,"n_rows":309,"n_cols":10,"rows_kept":309,"hidden":true}
["Dependant Dropdown Spill List"]
["Horizontal Spill for AC/FCU Brands"]
[{"$f":"TRANSPOSE(_xlfn.UNIQUE(_xlfn._xlws.FILTER(ct_01[AC/FCU Brand],ct_01[Zone Application Type]=ZoneTypes!G3,\"\")))","v":"PLEASE SELECT"},"Daikin","Mitsubishi","Toshiba","Sanyo ","Panasonic ","Fujitsu ","Hitachi ","LG","Other"]
[{"$f":"TRANSPOSE(_xlfn.UNIQUE(_xlfn._xlws.FILTER(ct_01[AC/FCU Brand],ct_01[Zone Application Type]=ZoneTypes!G4,\"\")))","v":"PLEASE SELECT"},"Daikin","Mitsubishi","Toshiba","Sanyo ","Panasonic ","Fujitsu ","Hitachi ","LG","Other"]
[{"$f":"TRANSPOSE(_xlfn.UNIQUE(_xlfn._xlws.FILTER(ct_01[AC/FCU Brand],ct_01[Zone Application Type]=ZoneTypes!G5,\"\")))","v":"PLEASE SELECT"},"Daikin","Mitsubishi","Toshiba","Sanyo ","Panasonic ","Fujitsu ","Hitachi ","LG","Other"]
[{"$f":"TRANSPOSE(_xlfn.UNIQUE(_xlfn._xlws.FILTER(ct_01[AC/FCU Brand],ct_01[Zone Application Type]=ZoneTypes!G6,\"\")))","v":"PLEASE SELECT"},"Daikin","Mitsubishi","Toshiba","Sanyo ","Panasonic ","Fujitsu ","Hitachi ","LG","Other"]
[{"$f":"TRANSPOSE(_xlfn.UNIQUE(_xlfn._xlws.FILTER(ct_01[AC/FCU Brand],ct_01[Zone Application Type]=ZoneTypes!G7,\"\")))","v":"PLEASE SELECT"},"Daikin","Mitsubishi","Toshiba","Sanyo ","Panasonic ","Fujitsu ","Hitachi ","LG","Other"]
[{"$f":"TRANSPOSE(_xlfn.UNIQUE(_xlfn._xlws.FILTER(ct_01[AC/FCU Brand],ct_01[Zone Application Type]=ZoneTypes!G8,\"\")))","v":"PLEASE SELECT"},"Daikin","Mitsubishi","Toshiba","Sanyo ","Panasonic ","Fujitsu ","Hitachi ","LG","Other"]
[{"$f":"TRANSPOSE(_xlfn.UNIQUE(_xlfn._xlws.FILTER(ct_01[AC/FCU Brand],ct_01[Zone Application Type]=ZoneTypes!G9,\"\")))","v":"N/A"}]
[{"$f":"TRANSPOSE(_xlfn.UNIQUE(_xlfn._xlws.FILTER(ct_01[AC/FCU Brand],ct_01[Zone Application Type]=ZoneTypes!G10,\"\")))","v":"N/A"}]
[{"$f":"TRANSPOSE(_xlfn.UNIQUE(_xlfn._xlws.FILTER(ct_01[AC/FCU Brand],ct_01[Zone Application Type]=ZoneTypes!G11,\"\")))","v":"N/A"}]
[{"$f":"TRANSPOSE(_xlfn.UNIQUE(_xlfn._xlws.FILTER(ct_01[AC/FCU Brand],ct_01[Zone Application Type]=ZoneTypes!G12,\"\")))","v":"N/A"}]
[{"$f":"TRANSPOSE(_xlfn.UNIQUE(_xlfn._xlws.FILTER(ct_01[AC/FCU Brand],ct_01[Zone Application Type]=ZoneTypes!G13,\"\")))","v":"N/A"}]
[{"$f":"TRANSPOSE(_xlfn.UNIQUE(_xlfn._xlws.FILTER(ct_01[AC/FCU Brand],ct_01[Zone Application Type]=ZoneTypes!G14,\"\")))","v":"N/A"}]
[{"$f":"TRANSPOSE(_xlfn.UNIQUE(_xlfn._xlws.FILTER(ct_01[AC/FCU Brand],ct_01[Zone Application Type]=ZoneTypes!G15,\"\")))","v":"N/A"}]
{"$rows_left_out":295}
{"sheet":"SpillFTL","index":5,"n_rows":309,"n_cols":18,"rows_kept":309,"hidden":true}
["Dependant Dropdown Spill List"]
["Horizontal Spill for Floor Temperature Limits °C"]
[{"$f":"TRANSPOSE(_xlfn.UNIQUE(_xlfn._xlws.FILTER(ct_01[Floor Temperature Limit °C],ct_01[Zone Application Type]=ZoneTypes!G3,\"\")))","v":"N/A"}]
[{"$f":"TRANSPOSE(_xlfn.UNIQUE(_xlfn._xlws.FILTER(ct_01[Floor Temperature Limit °C],ct_01[Zone Application Type]=ZoneTypes!G4,\"\")))","v":"PLEASE SELECT"},"TBA","25 °C","26 °C","27 °C","28 °C","29 °C","30 °C","31 °C","32 °C","33 °C","34 °C","35 °C","36 °C","37 °C","38 °C","39 °C","40 °C"]
[{"$f":"TRANSPOSE(_xlfn.UNIQUE(_xlfn._xlws.FILTER(ct_01[Floor Temperature Limit °C],ct_01[Zone Application Type]=ZoneTypes!G5,\"\")))","v":"N/A"}]
[{"$f":"TRANSPOSE(_xlfn.UNIQUE(_xlfn._xlws.FILTER(ct_01[Floor Temperature Limit °C],ct_01[Zone Application Type]=ZoneTypes!G6,\"\")))","v":"PLEASE SELECT"},"TBA","25 °C","26 °C","27 °C","28 °C","29 °C","30 °C","31 °C","32 °C","33 °C","34 °C","35 °C","36 °C","37 °C","38 °C","39 °C","40 °C"]
[{"$f":"TRANSPOSE(_xlfn.UNIQUE(_xlfn._xlws.FILTER(ct_01[Floor Temperature Limit °C],ct_01[Zone Application Type]=ZoneTypes!G7,\"\")))","v":"N/A"}]
[{"$f":"TRANSPOSE(_xlfn.UNIQUE(_xlfn._xlws.FILTER(ct_01[Floor Temperature Limit °C],ct_01[Zone Application Type]=ZoneTypes!G8,\"\")))","v":"N/A"}]
[{"$f":"TRANSPOSE(_xlfn.UNIQUE(_xlfn._xlws.FILTER(ct_01[Floor Temperature Limit °C],ct_01[Zone Application Type]=ZoneTypes!G9,\"\")))","v":"N/A"}]
[{"$f":"TRANSPOSE(_xlfn.UNIQUE(_xlfn._xlws.FILTER(ct_01[Floor Temperature Limit °C],ct_01[Zone Application Type]=ZoneTypes!G10,\"\")))","v":"PLEASE SELECT"},"TBA","25 °C","26 °C","27 °C","28 °C","29 °C","30 °C","31 °C","32 °C","33 °C","34 °C","35 °C","36 °C","37 °C","38 °C","39 °C","40 °C"]
[{"$f":"TRANSPOSE(_xlfn.UNIQUE(_xlfn._xlws.FILTER(ct_01[Floor Temperature Limit °C],ct_01[Zone Application Type]=ZoneTypes!G11,\"\")))","v":"N/A"}]
[{"$f":"TRANSPOSE(_xlfn.UNIQUE(_xlfn._xlws.FILTER(ct_01[Floor Temperature Limit °C],ct_01[Zone Application Type]=ZoneTypes!G12,\"\")))","v":"N/A"}]
[{"$f":"TRANSPOSE(_xlfn.UNIQUE(_xlfn._xlws.FILTER(ct_01[Floor Temperature Limit °C],ct_01[Zone Application Type]=ZoneTypes!G13,\"\")))","v":"PLEASE SELECT"},"TBA","25 °C","26 °C","27 °C","28 °C","29 °C","30 °C","31 °C","32 °C","33 °C","34 °C","35 °C","36 °C","37 °C","38 °C","39 °C","40 °C"]
[{"$f":"TRANSPOSE(_xlfn.UNIQUE(_xlfn._xlws.FILTER(ct_01[Floor Temperature Limit °C],ct_01[Zone Application Type]=ZoneTypes!G14,\"\")))","v":"N/A"}]
[{"$f":"TRANSPOSE(_xlfn.UNIQUE(_xlfn._xlws.FILTER(ct_01[Floor Temperature Limit °C],ct_01[Zone Application Type]=ZoneTypes!G15,\"\")))","v":"N/A"}]
{"$rows_left_out":295}
{"sheet":"SpillZTS","index":6,"n_rows":309,"n_cols":4,"rows_kept":309,"hidden":true}
["Dependant Dropdown Spill List"]
["Horizontal Spill for Zone Temperature Sensors"]
[{"$f":"TRANSPOSE(_xlfn.UNIQUE(_xlfn._xlws.FILTER(ct_01[Zone Temp Sensor],ct_01[Zone Application Type]=ZoneTypes!G3,\"\")))","v":"PLEASE SELECT"},"Room Thimble Sensor","AC Unit","Wired Controller"]
[{"$f":"TRANSPOSE(_xlfn.UNIQUE(_xlfn._xlws.FILTER(ct_01[Zone Temp Sensor],ct_01[Zone Application Type]=ZoneTypes!G4,\"\")))","v":"PLEASE SELECT"},"Room Thimble Sensor","AC Unit","Wired Controller"]
[{"$f":"TRANSPOSE(_xlfn.UNIQUE(_xlfn._xlws.FILTER(ct_01[Zone Temp Sensor],ct_01[Zone Application Type]=ZoneTypes!G5,\"\")))","v":"PLEASE SELECT"},"Room Thimble Sensor","AC Unit","Wired Controller"]
[{"$f":"TRANSPOSE(_xlfn.UNIQUE(_xlfn._xlws.FILTER(ct_01[Zone Temp Sensor],ct_01[Zone Application Type]=ZoneTypes!G6,\"\")))","v":"PLEASE SELECT"},"Room Thimble Sensor","AC Unit","Wired Controller"]
[{"$f":"TRANSPOSE(_xlfn.UNIQUE(_xlfn._xlws.FILTER(ct_01[Zone Temp Sensor],ct_01[Zone Application Type]=ZoneTypes!G7,\"\")))","v":"PLEASE SELECT"},"Room Thimble Sensor","AC Unit","Wired Controller"]
[{"$f":"TRANSPOSE(_xlfn.UNIQUE(_xlfn._xlws.FILTER(ct_01[Zone Temp Sensor],ct_01[Zone Application Type]=ZoneTypes!G8,\"\")))","v":"PLEASE SELECT"},"Room Thimble Sensor","AC Unit","Wired Controller"]
[{"$f":"TRANSPOSE(_xlfn.UNIQUE(_xlfn._xlws.FILTER(ct_01[Zone Temp Sensor],ct_01[Zone Application Type]=ZoneTypes!G9,\"\")))","v":"PLEASE SELECT"},"Room Thimble Sensor","Wired Controller"]
[{"$f":"TRANSPOSE(_xlfn.UNIQUE(_xlfn._xlws.FILTER(ct_01[Zone Temp Sensor],ct_01[Zone Application Type]=ZoneTypes!G10,\"\")))","v":"PLEASE SELECT"},"Room Thimble Sensor","Wired Controller"]
[{"$f":"TRANSPOSE(_xlfn.UNIQUE(_xlfn._xlws.FILTER(ct_01[Zone Temp Sensor],ct_01[Zone Application Type]=ZoneTypes!G11,\"\")))","v":"Floor Probe"}]
[{"$f":"TRANSPOSE(_xlfn.UNIQUE(_xlfn._xlws.FILTER(ct_01[Zone Temp Sensor],ct_01[Zone Application Type]=ZoneTypes!G12,\"\")))","v":"PLEASE SELECT"},"Room Thimble Sensor","Wired Controller"]
[{"$f":"TRANSPOSE(_xlfn.UNIQUE(_xlfn._xlws.FILTER(ct_01[Zone Temp Sensor],ct_01[Zone Application Type]=ZoneTypes!G13,\"\")))","v":"PLEASE SELECT"},"Room Thimble Sensor","Wired Controller"]
[{"$f":"TRANSPOSE(_xlfn.UNIQUE(_xlfn._xlws.FILTER(ct_01[Zone Temp Sensor],ct_01[Zone Application Type]=ZoneTypes!G14,\"\")))","v":"Floor Probe"}]
[{"$f":"TRANSPOSE(_xlfn.UNIQUE(_xlfn._xlws.FILTER(ct_01[Zone Temp Sensor],ct_01[Zone Application Type]=ZoneTypes!G15,\"\")))","v":"PLEASE SELECT"},"Room Thimble Sensor","Wired Controller"]
{"$rows_left_out":295}
{"sheet":"ZoneTypes","index":7,"n_rows":162,"n_cols":25,"rows_kept":162,"merged":[[0,20,0,24],[2,0,20,0],[33,0,33,24],[34,4,41,4],[42,4,49,4],[50,4,57,4],[58,4,65,4],[66,4,73,4],[74,4,81,4],[82,4,89,4],[90,4,97,4],[98,4,105,4],[106,4,113,4],[114,4,121,4],[122,4,129,4],[130,4,137,4],[138,4,145,4],[146,4,153,4],[154,4,161,4]]}
[{"$nulls":20},"Commissioning Section"]
["Plot","Floor","Room","UFH Manifold","CS","CH-8 Wiring Centre Zone ID","Zone Application Type","Zone Type","Air Con Brand","Air Con Model","FCU Reference","UFH Type","UFH Zone Reference","Floor Finish (Optional)"," Floor Temperature Protection Limit Required","Floor Temperature Limit °C","Temperature to be Controlled","Zone Temp Sensor","Wired Controller","Notes","ClimateSync Zone Address","CooLinkHub Virtual Zone Address","AC Central Address","CMN Line"," Address for Automation Zone Driver"]
["Examples of Application Combinations Available","Ground","Lounge","M1",null,"1-1","A",{"$f":"VLOOKUP($G3,CleanCombi!$A$1:$H$1826,2,0)","v":"Heating + Air Con"},"PLEASE SELECT",null,null,{"$f":"VLOOKUP($G3,CleanCombi!$A$1:$H$1826,4,0)","v":"WET UFH"},null,null,{"$f":"VLOOKUP($G3,CleanCombi!$A$1:$H$1826,5,0)","v":"NO"},"N/A",{"$f":"VLOOKUP($G3,CleanCombi!$A$1:$H$1826,7,0)","v":"Room Temp"},"PLEASE SELECT"]
[null,"1st","Master Bedroom","M2",null,"1-1","B",{"$f":"VLOOKUP($G4,CleanCombi!$A$1:$H$1826,2,0)","v":"Heating + Air Con"},"PLEASE SELECT",null,null,{"$f":"VLOOKUP($G4,CleanCombi!$A$1:$H$1826,4,0)","v":"WET UFH"},null,null,{"$f":"VLOOKUP($G4,CleanCombi!$A$1:$H$1826,5,0)","v":"YES"},"PLEASE SELECT",{"$f":"VLOOKUP($G4,CleanCombi!$A$1:$H$1826,7,0)","v":"Room Temp"},"PLEASE SELECT"]
[null,"1st","Master EnSuite","M3",null,"1-1","C",{"$f":"VLOOKUP($G5,CleanCombi!$A$1:$H$1826,2,0)","v":"Heating + Air Con"},"PLEASE SELECT",null,null,{"$f":"VLOOKUP($G5,CleanCombi!$A$1:$H$1826,4,0)","v":"ELECTRIC UFH"},null,null,{"$f":"VLOOKUP($G5,CleanCombi!$A$1:$H$1826,5,0)","v":"NO"},"N/A",{"$f":"VLOOKUP($G5,CleanCombi!$A$1:$H$1826,7,0)","v":"Room Temp"},"PLEASE SELECT"]
[{"$nulls":6},"D",{"$f":"VLOOKUP($G6,CleanCombi!$A$1:$H$1826,2,0)","v":"Heating + Air Con"},"PLEASE SELECT",null,null,{"$f":"VLOOKUP($G6,CleanCombi!$A$1:$H$1826,4,0)","v":"ELECTRIC UFH"},null,null,{"$f":"VLOOKUP($G6,CleanCombi!$A$1:$H$1826,5,0)","v":"YES"},"PLEASE SELECT",{"$f":"VLOOKUP($G6,CleanCombi!$A$1:$H$1826,7,0)","v":"Room Temp"},"PLEASE SELECT"]
[{"$nulls":6},"E",{"$f":"VLOOKUP($G7,CleanCombi!$A$1:$H$1826,2,0)","v":"Heating + Air Con"},"PLEASE SELECT",null,null,{"$f":"VLOOKUP($G7,CleanCombi!$A$1:$H$1826,4,0)","v":"RADIATOR"},null,null,{"$f":"VLOOKUP($G7,CleanCombi!$A$1:$H$1826,5,0)","v":"N/A"},"N/A",{"$f":"VLOOKUP($G7,CleanCombi!$A$1:$H$1826,7,0)","v":"Room Temp"},"PLEASE SELECT"]
[{"$nulls":6},"F",{"$f":"VLOOKUP($G8,CleanCombi!$A$1:$H$1826,2,0)","v":"AC only"},"PLEASE SELECT",null,null,{"$f":"VLOOKUP($G8,CleanCombi!$A$1:$H$1826,4,0)","v":"N/A"},null,null,{"$f":"VLOOKUP($G8,CleanCombi!$A$1:$H$1826,5,0)","v":"N/A"},"N/A",{"$f":"VLOOKUP($G8,CleanCombi!$A$1:$H$1826,7,0)","v":"Room Temp"},"PLEASE SELECT"]
[{"$nulls":6},"G",{"$f":"VLOOKUP($G9,CleanCombi!$A$1:$H$1826,2,0)","v":"Heating"},"N/A",null,null,{"$f":"VLOOKUP($G9,CleanCombi!$A$1:$H$1826,4,0)","v":"WET UFH"},null,null,{"$f":"VLOOKUP($G9,CleanCombi!$A$1:$H$1826,5,0)","v":"NO"},"N/A",{"$f":"VLOOKUP($G9,CleanCombi!$A$1:$H$1826,7,0)","v":"Room Temp"},"PLEASE SELECT"]
[{"$nulls":6},"H",{"$f":"VLOOKUP($G10,CleanCombi!$A$1:$H$1826,2,0)","v":"Heating"},"N/A",null,null,{"$f":"VLOOKUP($G10,CleanCombi!$A$1:$H$1826,4,0)","v":"WET UFH"},null,null,{"$f":"VLOOKUP($G10,CleanCombi!$A$1:$H$1826,5,0)","v":"YES"},"PLEASE SELECT",{"$f":"VLOOKUP($G10,CleanCombi!$A$1:$H$1826,7,0)","v":"Room Temp"},"PLEASE SELECT"]
[{"$nulls":6},"I",{"$f":"VLOOKUP($G11,CleanCombi!$A$1:$H$1826,2,0)","v":"Heating"},"N/A",null,null,{"$f":"VLOOKUP($G11,CleanCombi!$A$1:$H$1826,4,0)","v":"WET UFH"},null,null,{"$f":"VLOOKUP($G11,CleanCombi!$A$1:$H$1826,5,0)","v":"NO"},"N/A",{"$f":"VLOOKUP($G11,CleanCombi!$A$1:$H$1826,7,0)","v":"Floor Temp"},"Floor Probe"]
[{"$nulls":6},"J",{"$f":"VLOOKUP($G12,CleanCombi!$A$1:$H$1826,2,0)","v":"Heating"},"N/A",null,null,{"$f":"VLOOKUP($G12,CleanCombi!$A$1:$H$1826,4,0)","v":"ELECTRIC UFH"},null,null,{"$f":"VLOOKUP($G12,CleanCombi!$A$1:$H$1826,5,0)","v":"NO"},"N/A",{"$f":"VLOOKUP($G12,CleanCombi!$A$1:$H$1826,7,0)","v":"Room Temp"},"PLEASE SELECT"]
[{"$nulls":6},"K",{"$f":"VLOOKUP($G13,CleanCombi!$A$1:$H$1826,2,0)","v":"Heating"},"N/A",null,null,{"$f":"VLOOKUP($G13,CleanCombi!$A$1:$H$1826,4,0)","v":"ELECTRIC UFH"},null,null,{"$f":"VLOOKUP($G13,CleanCombi!$A$1:$H$1826,5,0)","v":"YES"},"PLEASE SELECT",{"$f":"VLOOKUP($G13,CleanCombi!$A$1:$H$1826,7,0)","v":"Room Temp"},"PLEASE SELECT"]
[{"$nulls":6},"L",{"$f":"VLOOKUP($G14,CleanCombi!$A$1:$H$1826,2,0)","v":"Heating"},"N/A",null,null,{"$f":"VLOOKUP($G14,CleanCombi!$A$1:$H$1826,4,0)","v":"ELECTRIC UFH"},null,null,{"$f":"VLOOKUP($G14,CleanCombi!$A$1:$H$1826,5,0)","v":"NO"},"N/A",{"$f":"VLOOKUP($G14,CleanCombi!$A$1:$H$1826,7,0)","v":"Floor Temp"},"Floor Probe"]
[{"$nulls":6},"M",{"$f":"VLOOKUP($G15,CleanCombi!$A$1:$H$1826,2,0)","v":"Heating"},"N/A",null,null,{"$f":"VLOOKUP($G15,CleanCombi!$A$1:$H$1826,4,0)","v":"RADIATOR"},null,null,{"$f":"VLOOKUP($G15,CleanCombi!$A$1:$H$1826,5,0)","v":"N/A"},"N/A",{"$f":"VLOOKUP($G15,CleanCombi!$A$1:$H$1826,7,0)","v":"Room Temp"},"PLEASE SELECT"]
{"$rows_left_out":147}