{"text_format":"3","workbook":"xlsx","n_sheets":8,"sheets":["OptionsUniques","Menu","CleanCombi","CombiTable","SpillACB","SpillFTL","SpillZTS","ZoneTypes"],"not_rendered":{"macros":1,"defined_names":1},"read":"whole","date_system":"1900"}

{"sheet":"OptionsUniques","index":0,"n_rows":322,"n_cols":12,"rows_kept":322,"hidden":true}
["Zone Application Type","Zone Type","Air Con / FCU Brand","Air Con Model","FCU Reference","UFH Type","UFH Zone Reference","Floor Finish (Optional)"," Floor Temperature Protection Limit Required","Floor Temperature Limit °C","Temperature to be Controlled","Zone Temp Sensor"]
["A","Heating + Air Con","Daikin",null,null,"WET UFH",null,null,"NO","N/A","Room Temp","Room Thimble Sensor"]
[null,null,"Mitsubishi",{"$nulls":8},"AC Unit"]
[null,null,"Toshiba",{"$nulls":8},"Wired Controller"]
[null,null,"Sanyo "]
[null,null,"Panasonic "]
[null,null,"Fujitsu "]
[null,null,"Hitachi "]
[null,null,"LG"]
[null,null,"Other"]
[]
["B","Heating + Air Con","Daikin",null,null,"WET UFH",null,null,"YES","TBA","Room Temp","Room Thimble Sensor"]
[null,null,"Mitsubishi",{"$nulls":6},"25 °C",null,"AC Unit"]
[null,null,"Toshiba",{"$nulls":6},"26 °C",null,"Wired Controller"]
[null,null,"Sanyo ",{"$nulls":6},"27 °C"]
[null,null,"Panasonic ",{"$nulls":6},"28 °C"]
[null,null,"Fujitsu ",{"$nulls":6},"29 °C"]
[null,null,"Hitachi ",{"$nulls":6},"30 °C"]
[null,null,"LG",{"$nulls":6},"31 °C"]
[null,null,"Other",{"$nulls":6},"32 °C"]
[{"$nulls":9},"33 °C"]
[{"$nulls":9},"34 °C"]
[{"$nulls":9},"35 °C"]
[{"$nulls":9},"36 °C"]
[{"$nulls":9},"37 °C"]
[{"$nulls":9},"38 °C"]
[{"$nulls":9},"39 °C"]
[{"$nulls":9},"40 °C"]
[]
["C","Heating + Air Con","Daikin",null,null,"ELECTRIC UFH",null,null,"NO","N/A","Room Temp","Room Thimble Sensor"]
[null,null,"Mitsubishi",{"$nulls":8},"AC Unit"]
[null,null,"Toshiba",{"$nulls":8},"Wired Controller"]
[null,null,"Sanyo "]
[null,null,"Panasonic "]
[null,null,"Fujitsu "]
[null,null,"Hitachi "]
[null,null,"LG"]
[null,null,"Other"]
[]
["D","Heating + Air Con","Daikin",null,null,"ELECTRIC UFH",null,null,"YES","TBA","Room Temp","Room Thimble Sensor"]
[null,null,"Mitsubishi",{"$nulls":6},"25 °C",null,"AC Unit"]
[null,null,"Toshiba",{"$nulls":6},"26 °C",null,"Wired Controller"]
[null,null,"Sanyo ",{"$nulls":6},"27 °C"]
[null,null,"Panasonic ",{"$nulls":6},"28 °C"]
[null,null,"Fujitsu ",{"$nulls":6},"29 °C"]
[null,null,"Hitachi ",{"$nulls":6},"30 °C"]
[null,null,"LG",{"$nulls":6},"31 °C"]
[null,null,"Other",{"$nulls":6},"32 °C"]
[{"$nulls":9},"33 °C"]
[{"$nulls":9},"34 °C"]
[{"$nulls":9},"35 °C"]
[{"$nulls":9},"36 °C"]
[{"$nulls":9},"37 °C"]
[{"$nulls":9},"38 °C"]
[{"$nulls":9},"39 °C"]
[{"$nulls":9},"40 °C"]
[]
["E","Heating + Air Con","Daikin",null,null,"RADIATOR",null,null,"N/A","N/A","Room Temp","Room Thimble Sensor"]
[null,null,"Mitsubishi",{"$nulls":8},"AC Unit"]
[null,null,"Toshiba",{"$nulls":8},"Wired Controller"]
[null,null,"Sanyo "]
[null,null,"Panasonic "]
[null,null,"Fujitsu "]
[null,null,"Hitachi "]
[null,null,"LG"]
[null,null,"Other"]
[]
["F","AC only","Daikin",null,null,"N/A",null,null,"N/A","N/A","Room Temp","Room Thimble Sensor"]
[null,null,"Mitsubishi",{"$nulls":8},"AC Unit"]
[null,null,"Toshiba",{"$nulls":8},"Wired Controller"]
[null,null,"Sanyo "]
[null,null,"Panasonic "]
[null,null,"Fujitsu "]
[null,null,"Hitachi "]
[null,null,"LG"]
[null,null,"Other"]
[]
["G","Heating","N/A",null,null,"WET UFH",null,null,"NO","N/A","Room Temp","Room Thimble Sensor"]
[{"$nulls":11},"Wired Controller"]
[]
["H","Heating","N/A",null,null,"WET UFH",null,null,"YES","TBA","Room Temp","Room Thimble Sensor"]
[{"$nulls":9},"25 °C",null,"Wired Controller"]
[{"$nulls":9},"26 °C"]
[{"$nulls":9},"27 °C"]
[{"$nulls":9},"28 °C"]
[{"$nulls":9},"29 °C"]
[{"$nulls":9},"30 °C"]
[{"$nulls":9},"31 °C"]
[{"$nulls":9},"32 °C"]
[{"$nulls":9},"33 °C"]
[{"$nulls":9},"34 °C"]
[{"$nulls":9},"35 °C"]
[{"$nulls":9},"36 °C"]
[{"$nulls":9},"37 °C"]
[{"$nulls":9},"38 °C"]
[{"$nulls":9},"39 °C"]
[{"$nulls":9},"40 °C"]
[]
["I","Heating","N/A",null,null,"WET UFH",null,null,"NO","N/A","Floor Temp","Floor Probe"]
[]
["J","Heating","N/A",null,null,"ELECTRIC UFH",null,null,"NO","N/A","Room Temp","Room Thimble Sensor"]
[{"$nulls":11},"Wired Controller"]
[]
["K","Heating","N/A",null,null,"ELECTRIC UFH",null,null,"YES","TBA","Room Temp","Room Thimble Sensor"]
[{"$nulls":9},"25 °C",null,"Wired Controller"]
[{"$nulls":9},"26 °C"]
[{"$nulls":9},"27 °C"]
[{"$nulls":9},"28 °C"]
[{"$nulls":9},"29 °C"]
[{"$nulls":9},"30 °C"]
[{"$nulls":9},"31 °C"]
[{"$nulls":9},"32 °C"]
[{"$nulls":9},"33 °C"]
[{"$nulls":9},"34 °C"]
[{"$nulls":9},"35 °C"]
[{"$nulls":9},"36 °C"]
[{"$nulls":9},"37 °C"]
[{"$nulls":9},"38 °C"]
[{"$nulls":9},"39 °C"]
[{"$nulls":9},"40 °C"]
[]
["L","Heating","N/A",null,null,"ELECTRIC UFH",null,null,"NO","N/A","Floor Temp","Floor Probe"]
[]
["M","Heating","N/A",null,null,"RADIATOR",null,null,"N/A","N/A","Room Temp","Room Thimble Sensor"]
[{"$nulls":11},"Wired Controller"]
[]
["N","ON/OFF SWITCH","N/A",null,null,"N/A",null,null,"N/A","N/A","ON/OFF Only","N/A"]
[]
["O","Towel Rad ON/OFF Only","N/A",null,null,"N/A",null,null,"N/A","N/A","ON/OFF Only","N/A"]
[]
["P","Towel Rad Temp Control","N/A",null,null,"RADIATOR",null,null,"N/A","N/A","Room Temp","Room Thimble Sensor"]
[{"$nulls":11},"Wired Controller"]
[]
["Q","Hot Water ON/OFF","N/A",null,null,"N/A",null,null,"N/A","N/A","ON/OFF Only","N/A"]
[]
["R","Hot Water, Temp Control (Valve Only)","N/A",null,null,"N/A",null,null,"N/A","N/A","Cylinder Temp","Cylinder Probe"]
[]
["S","Hot Water, Temp Control (Valve & Boiler)","N/A",null,null,"N/A",null,null,"N/A","N/A","Cylinder Temp","Cylinder Probe"]
[]
["FA","Heating + FCU","Daikin",null,null,"WET UFH",null,null,"NO","N/A","Room Temp","Wired Controller"]
[null,null,"Mitsubishi"]
[null,null,"Toshiba"]
[null,null,"Sanyo "]
[null,null,"Panasonic "]
[null,null,"Fujitsu "]
[null,null,"Hitachi "]
[null,null,"LG"]
[null,null,"Other"]
[]
["FB","Heating + FCU","Daikin",null,null,"WET UFH",null,null,"YES","TBA","Room Temp","Wired Controller"]
[null,null,"Mitsubishi",{"$nulls":6},"25 °C"]
[null,null,"Toshiba",{"$nulls":6},"26 °C"]
[null,null,"Sanyo ",{"$nulls":6},"27 °C"]
[null,null,"Panasonic ",{"$nulls":6},"28 °C"]
[null,null,"Fujitsu ",{"$nulls":6},"29 °C"]
[null,null,"Hitachi ",{"$nulls":6},"30 °C"]
[null,null,"LG",{"$nulls":6},"31 °C"]
[null,null,"Other",{"$nulls":6},"32 °C"]
[{"$nulls":9},"33 °C"]
[{"$nulls":9},"34 °C"]
[{"$nulls":9},"35 °C"]
[{"$nulls":9},"36 °C"]
[{"$nulls":9},"37 °C"]
[{"$nulls":9},"38 °C"]
[{"$nulls":9},"39 °C"]
[{"$nulls":9},"40 °C"]
[]
["FC","Heating + FCU","Daikin",null,null,"ELECTRIC UFH",null,null,"NO","N/A","Room Temp","Wired Controller"]
[null,null,"Mitsubishi"]
[null,null,"Toshiba"]
[null,null,"Sanyo "]
[null,null,"Panasonic "]
[null,null,"Fujitsu "]
[null,null,"Hitachi "]
[null,null,"LG"]
[null,null,"Other"]
[]
["FD","Heating + FCU","Daikin",null,null,"ELECTRIC UFH",null,null,"YES","TBA","Room Temp","Wired Controller"]
[null,null,"Mitsubishi",{"$nulls":6},"25 °C"]
[null,null,"Toshiba",{"$nulls":6},"26 °C"]
[null,null,"Sanyo ",{"$nulls":6},"27 °C"]
[null,null,"Panasonic ",{"$nulls":6},"28 °C"]
[null,null,"Fujitsu ",{"$nulls":6},"29 °C"]
[null,null,"Hitachi ",{"$nulls":6},"30 °C"]
[null,null,"LG",{"$nulls":6},"31 °C"]
[null,null,"Other",{"$nulls":6},"32 °C"]
[{"$nulls":9},"33 °C"]
[{"$nulls":9},"34 °C"]
[{"$nulls":9},"35 °C"]
[{"$nulls":9},"36 °C"]
[{"$nulls":9},"37 °C"]
[{"$nulls":9},"38 °C"]
[{"$nulls":9},"39 °C"]
[{"$nulls":9},"40 °C"]
[]
["FE","Heating + FCU","Daikin",null,null,"RADIATOR",null,null,"N/A","N/A","Room Temp","Wired Controller"]
[null,null,"Mitsubishi"]
[null,null,"Toshiba"]
[null,null,"Sanyo "]
[null,null,"Panasonic "]
[null,null,"Fujitsu "]
[null,null,"Hitachi "]
[null,null,"LG"]
[null,null,"Other"]
[]
["FF","FCU only","Daikin",null,null,"N/A",null,null,"N/A","N/A","Room Temp","Wired Controller"]
[null,null,"Mitsubishi"]
[null,null,"Toshiba"]
[null,null,"Sanyo "]
[null,null,"Panasonic "]
[null,null,"Fujitsu "]
[null,null,"Hitachi "]
[null,null,"LG"]
[null,null,"Other"]
[]
["FAB","Heating + FCU","Daikin",null,null,"WET UFH",null,null,"NO","N/A","Room Temp","ClimateSync Room Sensor"]
[null,null,"Mitsubishi"]
[null,null,"Toshiba"]
[null,null,"Sanyo "]
[null,null,"Panasonic "]
[null,null,"Fujitsu "]
[null,null,"Hitachi "]
[null,null,"LG"]
[null,null,"Other"]
[]
["FBB","Heating + FCU","Daikin",null,null,"WET UFH",null,null,"YES","TBA","Room Temp","ClimateSync Room Sensor"]
[null,null,"Mitsubishi",{"$nulls":6},"25 °C"]
[null,null,"Toshiba",{"$nulls":6},"26 °C"]
[null,null,"Sanyo ",{"$nulls":6},"27 °C"]
[null,null,"Panasonic ",{"$nulls":6},"28 °C"]
[null,null,"Fujitsu ",{"$nulls":6},"29 °C"]
[null,null,"Hitachi ",{"$nulls":6},"30 °C"]
[null,null,"LG",{"$nulls":6},"31 °C"]
[null,null,"Other",{"$nulls":6},"32 °C"]
[{"$nulls":9},"33 °C"]
[{"$nulls":9},"34 °C"]
[{"$nulls":9},"35 °C"]
[{"$nulls":9},"36 °C"]
[{"$nulls":9},"37 °C"]
[{"$nulls":9},"38 °C"]
[{"$nulls":9},"39 °C"]
[{"$nulls":9},"40 °C"]
[]
["FCB","Heating + FCU","Daikin",null,null,"ELECTRIC UFH",null,null,"NO","N/A","Room Temp","ClimateSync Room Sensor"]
[null,null,"Mitsubishi"]
[null,null,"Toshiba"]
[null,null,"Sanyo "]
[null,null,"Panasonic "]
[null,null,"Fujitsu "]
[null,null,"Hitachi "]
[null,null,"LG"]
[null,null,"Other"]
[]
["FDB","Heating + FCU","Daikin",null,null,"ELECTRIC UFH",null,null,"YES","TBA","Room Temp","ClimateSync Room Sensor"]
[null,null,"Mitsubishi",{"$nulls":6},"25 °C"]
[null,null,"Toshiba",{"$nulls":6},"26 °C"]
[null,null,"Sanyo ",{"$nulls":6},"27 °C"]
[null,null,"Panasonic ",{"$nulls":6},"28 °C"]
[null,null,"Fujitsu ",{"$nulls":6},"29 °C"]
[null,null,"Hitachi ",{"$nulls":6},"30 °C"]
[null,null,"LG",{"$nulls":6},"31 °C"]
[null,null,"Other",{"$nulls":6},"32 °C"]
[{"$nulls":9},"33 °C"]
[{"$nulls":9},"34 °C"]
[{"$nulls":9},"35 °C"]
[{"$nulls":9},"36 °C"]
[{"$nulls":9},"37 °C"]
[{"$nulls":9},"38 °C"]
[{"$nulls":9},"39 °C"]
[{"$nulls":9},"40 °C"]
[]
["FEB","Heating + FCU","Daikin",null,null,"RADIATOR",null,null,"N/A","N/A","Room Temp","ClimateSync Room Sensor"]
[null,null,"Mitsubishi"]
[null,null,"Toshiba"]
[null,null,"Sanyo "]
[null,null,"Panasonic "]
[null,null,"Fujitsu "]
[null,null,"Hitachi "]
[null,null,"LG"]
[null,null,"Other"]
[]
["FFB","FCU only","Daikin",null,null,"N/A",null,null,"N/A","N/A","Room Temp","ClimateSync Room Sensor"]
[null,null,"Mitsubishi"]
[null,null,"Toshiba"]
[null,null,"Sanyo "]
[null,null,"Panasonic "]
[null,null,"Fujitsu "]
[null,null,"Hitachi "]
[null,null,"LG"]
[null,null,"Other"]
[]
["A","Heating + Air Con","PLEASE SELECT",null,null,"WET UFH",null,null,"NO","N/A","Room Temp","PLEASE SELECT"]
["B","Heating + Air Con","PLEASE SELECT",null,null,"WET UFH",null,null,"YES","PLEASE SELECT","Room Temp","PLEASE SELECT"]
["C","Heating + Air Con","PLEASE SELECT",null,null,"ELECTRIC UFH",null,null,"NO","N/A","Room Temp","PLEASE SELECT"]
["D","Heating + Air Con","PLEASE SELECT",null,null,"ELECTRIC UFH",null,null,"YES","PLEASE SELECT","Room Temp","PLEASE SELECT"]
["E","Heating + Air Con","PLEASE SELECT",null,null,"RADIATOR",null,null,"N/A","N/A","Room Temp","PLEASE SELECT"]
["F","AC only","PLEASE SELECT",null,null,"N/A",null,null,"N/A","N/A","Room Temp","PLEASE SELECT"]
["G","Heating","N/A",null,null,"WET UFH",null,null,"NO","N/A","Room Temp","PLEASE SELECT"]
["H","Heating","N/A",null,null,"WET UFH",null,null,"YES","PLEASE SELECT","Room Temp","PLEASE SELECT"]
["I","Heating","N/A",null,null,"WET UFH",null,null,"NO","N/A","Floor Temp","Floor Probe"]
["J","Heating","N/A",null,null,"ELECTRIC UFH",null,null,"NO","N/A","Room Temp","PLEASE SELECT"]
["K","Heating","N/A",null,null,"ELECTRIC UFH",null,null,"YES","PLEASE SELECT","Room Temp","PLEASE SELECT"]
["L","Heating","N/A",null,null,"ELECTRIC UFH",null,null,"NO","N/A","Floor Temp","Floor Probe"]
["M","Heating","N/A",null,null,"RADIATOR",null,null,"N/A","N/A","Room Temp","PLEASE SELECT"]
["N","ON/OFF SWITCH","N/A",null,null,"N/A",null,null,"N/A","N/A","ON/OFF Only","N/A"]
["O","Towel Rad ON/OFF Only","N/A",null,null,"N/A",null,null,"N/A","N/A","ON/OFF Only","N/A"]
["P","Towel Rad Temp Control","N/A",null,null,"RADIATOR",null,null,"N/A","N/A","Room Temp","PLEASE SELECT"]
["Q","Hot Water ON/OFF","N/A",null,null,"N/A",null,null,"N/A","N/A","ON/OFF Only","N/A"]
["R","Hot Water, Temp Control (Valve Only)","N/A",null,null,"N/A",null,null,"N/A","N/A","Cylinder Temp","Cylinder Probe"]
["S","Hot Water, Temp Control (Valve & Boiler)","N/A",null,null,"N/A",null,null,"N/A","N/A","Cylinder Temp","Cylinder Probe"]
["FA","Heating + FCU","PLEASE SELECT",null,null,"WET UFH",null,null,"NO","N/A","Room Temp","Wired Controller"]
["FB","Heating + FCU","PLEASE SELECT",null,null,"WET UFH",null,null,"YES","PLEASE SELECT","Room Temp","Wired Controller"]
["FC","Heating + FCU","PLEASE SELECT",null,null,"ELECTRIC UFH",null,null,"NO","N/A","Room Temp","Wired Controller"]
["FD","Heating + FCU","PLEASE SELECT",null,null,"ELECTRIC UFH",null,null,"YES","PLEASE SELECT","Room Temp","Wired Controller"]
["FE","Heating + FCU","PLEASE SELECT",null,null,"RADIATOR",null,null,"N/A","N/A","Room Temp","Wired Controller"]
["FF","FCU only","PLEASE SELECT",null,null,"N/A",null,null,"N/A","N/A","Room Temp","Wired Controller"]
["FAB","Heating + FCU","PLEASE SELECT",null,null,"WET UFH",null,null,"NO","N/A","Room Temp","ClimateSync Room Sensor"]
["FBB","Heating + FCU","PLEASE SELECT",null,null,"WET UFH",null,null,"YES","PLEASE SELECT","Room Temp","ClimateSync Room Sensor"]
["FCB","Heating + FCU","PLEASE SELECT",null,null,"ELECTRIC UFH",null,null,"NO","N/A","Room Temp","ClimateSync Room Sensor"]
["FDB","Heating + FCU","PLEASE SELECT",null,null,"ELECTRIC UFH",null,null,"YES","PLEASE SELECT","Room Temp","ClimateSync Room Sensor"]
["FEB","Heating + FCU","PLEASE SELECT",null,null,"RADIATOR",null,null,"N/A","N/A","Room Temp","ClimateSync Room Sensor"]
["FFB","FCU only","PLEASE SELECT",null,null,"N/A",null,null,"N/A","N/A","Room Temp","ClimateSync Room Sensor"]

{"sheet":"Menu","index":1,"n_rows":132,"n_cols":11,"rows_kept":132,"hidden":true}
["Floor","UFH Manifold","UFH Zone","Zone Application Type","Zone Type","Air Con / FCU Brand","UFH Type"," Floor Temperature Protection Limit Required","Floor Temperature Limit °C","Temperature to be Controlled","Zone Temp Sensor"]
[]
["PLEASE SELECT","PLEASE SELECT","PLEASE SELECT","PLEASE SELECT","PLEASE SELECT","PLEASE SELECT","PLEASE SELECT","PLEASE SELECT","PLEASE SELECT","PLEASE SELECT","PLEASE SELECT"]
[]
["Basement","M1","1-1","A","Heating + Air Con","Daikin","WET UFH","YES","N/A","Room Temp","Room Thimble Sensor"]
["Lower Ground","M2","1-2","B","Heating + FCU","Mitsubishi","ELECTRIC UFH","NO","TBA","Floor Temp","ClimateSync Room Sensor"]
["Ground","M3","1-3","C","AC only","Toshiba","RADIATOR","N/A","25 °C","Cylinder Temp","Floor Probe"]
["1st","M4","1-4","D","FCU Only","Sanyo ","N/A",null,"26 °C","ON/OFF Only","AC Unit"]
["2nd","M5","1-5","E","Heating","Panasonic ",null,null,"27 °C",null,"FCU Unit"]
["3rd","M6","1-6","F","Towel Rad ON/OFF Only","Fujitsu ",null,null,"28 °C",null,"Wired Controller"]
["4th","M7","1-7","G","Towel Rad Temp Control","Hitachi ",null,null,"29 °C",null,"Cylinder Probe"]
["5th","M8","1-8","H","ON/OFF SWITCH","LG",null,null,"30 °C",null,"N/A"]
["6th","M9","2-1","I","Hot Water ON/OFF","Other",null,null,"31 °C"]
[null,"M10","2-2","J","Hot Water, Temp Control (Valve Only)","N/A",null,null,"32 °C"]
[null,null,"2-3","K","Hot Water, Temp Control (Valve & Boiler)",{"$nulls":3},"33 °C"]
[null,null,"2-4","L",{"$nulls":4},"34 °C"]
[null,null,"2-5","M",{"$nulls":4},"35 °C"]
[null,null,"2-6","N",{"$nulls":4},"36 °C"]
[null,null,"2-7","O",{"$nulls":4},"37 °C"]
[null,null,"2-8","P",{"$nulls":4},"38 °C"]
[null,null,"3-1","Q",{"$nulls":4},"39 °C"]
[null,null,"3-2","R",{"$nulls":4},"40 °C"]
[null,null,"3-3","S"]
[null,null,"3-4","FA"]
[null,null,"3-5","FB"]
[null,null,"3-6","FC"]
[null,null,"3-7","FD"]
[null,null,"3-8","FE"]
[null,null,"4-1","FF"]
[null,null,"4-2","FAB"]
[null,null,"4-3","FBB"]
[null,null,"4-4","FCB"]
[null,null,"4-5","FDB"]
[null,null,"4-6","FEB"]
[null,null,"4-7","FFB"]
[null,null,"4-8"]
[null,null,"5-1"]
[null,null,"5-2"]
[null,null,"5-3"]
[null,null,"5-4"]
[null,null,"5-5"]
[null,null,"5-6"]
[null,null,"5-7"]
[null,null,"5-8"]
[null,null,"6-1"]
[null,null,"6-2"]
[null,null,"6-3"]
[null,null,"6-4"]
[null,null,"6-5"]
[null,null,"6-6"]
[null,null,"6-7"]
[null,null,"6-8"]
[null,null,"7-1"]
[null,null,"7-2"]
[null,null,"7-3"]
[null,null,"7-4"]
[null,null,"7-5"]
[null,null,"7-6"]
[null,null,"7-7"]
[null,null,"7-8"]
[null,null,"8-1"]
[null,null,"8-2"]
[null,null,"8-3"]
[null,null,"8-4"]
[null,null,"8-5"]
[null,null,"8-6"]
[null,null,"8-7"]
[null,null,"8-8"]
[null,null,"9-1"]
[null,null,"9-2"]
[null,null,"9-3"]
[null,null,"9-4"]
[null,null,"9-5"]
[null,null,"9-6"]
[null,null,"9-7"]
[null,null,"9-8"]
[null,null,"10-1"]
[null,null,"10-2"]
[null,null,"10-3"]
[null,null,"10-4"]
[null,null,"10-5"]
[null,null,"10-6"]
[null,null,"10-7"]
[null,null,"10-8"]
[null,null,"11-1"]
[null,null,"11-2"]
[null,null,"11-3"]
[null,null,"11-4"]
[null,null,"11-5"]
[null,null,"11-6"]
[null,null,"11-7"]
[null,null,"11-8"]
[null,null,"12-1"]
[null,null,"12-2"]
[null,null,"12-3"]
[null,null,"12-4"]
[null,null,"12-5"]
[null,null,"12-6"]
[null,null,"12-7"]
[null,null,"12-8"]
[null,null,"13-1"]
[null,null,"13-2"]
[null,null,"13-3"]
[null,null,"13-4"]
[null,null,"13-5"]
[null,null,"13-6"]
[null,null,"13-7"]
[null,null,"13-8"]
[null,null,"14-1"]
[null,null,"14-2"]
[null,null,"14-3"]
[null,null,"14-4"]
[null,null,"14-5"]
[null,null,"14-6"]
[null,null,"14-7"]
[null,null,"14-8"]
[null,null,"15-1"]
[null,null,"15-2"]
[null,null,"15-3"]
[null,null,"15-4"]
[null,null,"15-5"]
[null,null,"15-6"]
[null,null,"15-7"]
[null,null,"15-8"]
[null,null,"16-1"]
[null,null,"16-2"]
[null,null,"16-3"]
[null,null,"16-4"]
[null,null,"16-5"]
[null,null,"16-6"]
[null,null,"16-7"]
[null,null,"16-8"]

{"sheet":"CleanCombi","index":2,"n_rows":1826,"n_cols":18,"rows_kept":1826,"hidden":true}
["Zone Application Type","Zone Type","AC/FCU Brand","UFH Type","Floor Temperature Protection Limit Required","Floor Temperature Limit °C","Temperature to be Controlled","Zone Temp Sensor",null,null,"Static Uniques Per Column"]
["PLEASE SELECT","First Select Zone Application Type","First Select Zone Application Type","First Select Zone Application Type","First Select Zone Application Type","First Select Zone Application Type","First Select Zone Application Type","First Select Zone Application Type",null,null,"Zone Application Type","Zone Type","AC/FCU Brand","UFH Type","Floor Temperature Protection Limit Required","Floor Temperature Limit °C","Temperature to be Controlled","Zone Temp Sensor"]
["A","Heating + Air Con","PLEASE SELECT","WET UFH","NO","N/A","Room Temp","PLEASE SELECT",null,null,"PLEASE SELECT","First Select Zone Application Type","First Select Zone Application Type","First Select Zone Application Type","First Select Zone Application Type","First Select Zone Application Type","First Select Zone Application Type","First Select Zone Application Type"]
["B","Heating + Air Con","PLEASE SELECT","WET UFH","YES","PLEASE SELECT","Room Temp","PLEASE SELECT",null,null,"A","Heating + Air Con","PLEASE SELECT","WET UFH","NO","N/A","Room Temp","PLEASE SELECT"]
["C","Heating + Air Con","PLEASE SELECT","ELECTRIC UFH","NO","N/A","Room Temp","PLEASE SELECT",null,null,"B","AC only","N/A","ELECTRIC UFH","YES","PLEASE SELECT","Floor Temp","Floor Probe"]
["D","Heating + Air Con","PLEASE SELECT","ELECTRIC UFH","YES","PLEASE SELECT","Room Temp","PLEASE SELECT",null,null,"C","Heating","Daikin","RADIATOR","N/A","TBA","ON/OFF Only","N/A"]
["E","Heating + Air Con","PLEASE SELECT","RADIATOR","N/A","N/A","Room Temp","PLEASE SELECT",null,null,"D","ON/OFF SWITCH","Mitsubishi","N/A",null,"25 °C","Cylinder Temp","Cylinder Probe"]
["F","AC only","PLEASE SELECT","N/A","N/A","N/A","Room Temp","PLEASE SELECT",null,null,"E","Towel Rad ON/OFF Only","Toshiba",null,null,"26 °C",null,"Room Thimble Sensor"]
["G","Heating","N/A","WET UFH","NO","N/A","Room Temp","PLEASE SELECT",null,null,"F","Towel Rad Temp Control","Sanyo ",null,null,"27 °C",null,"AC Unit"]
["H","Heating","N/A","WET UFH","YES","PLEASE SELECT","Room Temp","PLEASE SELECT",null,null,"G","Hot Water ON/OFF","Panasonic ",null,null,"28 °C",null,"Wired Controller"]
["I","Heating","N/A","WET UFH","NO","N/A","Floor Temp","Floor Probe",null,null,"H","Hot Water, Temp Control (Valve Only)","Fujitsu ",null,null,"29 °C",null,"ClimateSync Room Sensor"]
["J","Heating","N/A","ELECTRIC UFH","NO","N/A","Room Temp","PLEASE SELECT",null,null,"I","Hot Water, Temp Control (Valve & Boiler)","Hitachi ",null,null,"30 °C"]
["K","Heating","N/A","ELECTRIC UFH","YES","PLEASE SELECT","Room Temp","PLEASE SELECT",null,null,"J","Heating + FCU","LG",null,null,"31 °C"]
["L","Heating","N/A","ELECTRIC UFH","NO","N/A","Floor Temp","Floor Probe",null,null,"K","FCU Only","Other",null,null,"32 °C"]
["M","Heating","N/A","RADIATOR","N/A","N/A","Room Temp","PLEASE SELECT",null,null,"L",{"$nulls":4},"33 °C"]
["N","ON/OFF SWITCH","N/A","N/A","N/A","N/A","ON/OFF Only","N/A",null,null,"M",{"$nulls":4},"34 °C"]
["O","Towel Rad ON/OFF Only","N/A","N/A","N/A","N/A","ON/OFF Only","N/A",null,null,"N",{"$nulls":4},"35 °C"]
["P","Towel Rad Temp Control","N/A","RADIATOR","N/A","N/A","Room Temp","PLEASE SELECT",null,null,"O",{"$nulls":4},"36 °C"]
["Q","Hot Water ON/OFF","N/A","N/A","N/A","N/A","ON/OFF Only","N/A",null,null,"P",{"$nulls":4},"37 °C"]
["R","Hot Water, Temp Control (Valve Only)","N/A","N/A","N/A","N/A","Cylinder Temp","Cylinder Probe",null,null,"Q",{"$nulls":4},"38 °C"]
["S","Hot Water, Temp Control (Valve & Boiler)","N/A","N/A","N/A","N/A","Cylinder Temp","Cylinder Probe",null,null,"R",{"$nulls":4},"39 °C"]
["A","Heating + Air Con","Daikin","WET UFH","NO","N/A","Room Temp","Room Thimble Sensor",null,null,"S",{"$nulls":4},"40 °C"]
["A","Heating + Air Con","Daikin","WET UFH","NO","N/A","Room Temp","AC Unit",null,null,"FA"]
["A","Heating + Air Con","Daikin","WET UFH","NO","N/A","Room Temp","Wired Controller",null,null,"FB"]
["B","Heating + Air Con","Daikin","WET UFH","YES","TBA","Room Temp","Room Thimble Sensor",null,null,"FC"]
["B","Heating + Air Con","Daikin","WET UFH","YES","TBA","Room Temp","AC Unit",null,null,"FD"]
["B","Heating + Air Con","Daikin","WET UFH","YES","TBA","Room Temp","Wired Controller",null,null,"FE"]
["B","Heating + Air Con","Daikin","WET UFH","YES","25 °C","Room Temp","Room Thimble Sensor",null,null,"FF"]
["B","Heating + Air Con","Daikin","WET UFH","YES","25 °C","Room Temp","AC Unit",null,null,"FAB"]
["B","Heating + Air Con","Daikin","WET UFH","YES","25 °C","Room Temp","Wired Controller",null,null,"FBB"]
["B","Heating + Air Con","Daikin","WET UFH","YES","26 °C","Room Temp","Room Thimble Sensor",null,null,"FCB"]
["B","Heating + Air Con","Daikin","WET UFH","YES","26 °C","Room Temp","AC Unit",null,null,"FDB"]
["B","Heating + Air Con","Daikin","WET UFH","YES","26 °C","Room Temp","Wired Controller",null,null,"FEB"]
["B","Heating + Air Con","Daikin","WET UFH","YES","27 °C","Room Temp","Room Thimble Sensor",null,null,"FFB"]
["B","Heating + Air Con","Daikin","WET UFH","YES","27 °C","Room Temp","AC Unit"]
["B","Heating + Air Con","Daikin","WET UFH","YES","27 °C","Room Temp","Wired Controller",null,null,"Dynamic Uniques Per Column"]
["B","Heating + Air Con","Daikin","WET UFH","YES","28 °C","Room Temp","Room Thimble Sensor",null,null,"Zone Application Type","Zone Type","AC/FCU Brand","UFH Type","Floor Temperature Protection Limit Required","Floor Temperature Limit °C","Temperature to be Controlled","Zone Temp Sensor"]
["B","Heating + Air Con","Daikin","WET UFH","YES","28 °C","Room Temp","AC Unit",null,null,{"$f":"_xlfn.UNIQUE(A2:A1826)","v":"PLEASE SELECT"},{"$f":"_xlfn.UNIQUE(B2:B1826)","v":"First Select Zone Application Type"},{"$f":"_xlfn.UNIQUE(C2:C1826)","v":"First Select Zone Application Type"},{"$f":"_xlfn.UNIQUE(D2:D1826)","v":"First Select Zone Application Type"},{"$f":"_xlfn.UNIQUE(E2:E1826)","v":"First Select Zone Application Type"},{"$f":"_xlfn.UNIQUE(F2:F1826)","v":"First Select Zone Application Type"},{"$f":"_xlfn.UNIQUE(G2:G1826)","v":"First Select Zone Application Type"},{"$f":"_xlfn.UNIQUE(H2:H1826)","v":"First Select Zone Application Type"}]
["B","Heating + Air Con","Daikin","WET UFH","YES","28 °C","Room Temp","Wired Controller",null,null,"A","Heating + Air Con","PLEASE SELECT","WET UFH","NO","N/A","Room Temp","PLEASE SELECT"]
["B","Heating + Air Con","Daikin","WET UFH","YES","29 °C","Room Temp","Room Thimble Sensor",null,null,"B","AC only","N/A","ELECTRIC UFH","YES","PLEASE SELECT","Floor Temp","Floor Probe"]
["B","Heating + Air Con","Daikin","WET UFH","YES","29 °C","Room Temp","AC Unit",null,null,"C","Heating","Daikin","RADIATOR","N/A","TBA","ON/OFF Only","N/A"]
["B","Heating + Air Con","Daikin","WET UFH","YES","29 °C","Room Temp","Wired Controller",null,null,"D","ON/OFF SWITCH","Mitsubishi","N/A",null,"25 °C","Cylinder Temp","Cylinder Probe"]
["B","Heating + Air Con","Daikin","WET UFH","YES","30 °C","Room Temp","Room Thimble Sensor",null,null,"E","Towel Rad ON/OFF Only","Toshiba",null,null,"26 °C",null,"Room Thimble Sensor"]
["B","Heating + Air Con","Daikin","WET UFH","YES","30 °C","Room Temp","AC Unit",null,null,"F","Towel Rad Temp Control","Sanyo ",null,null,"27 °C",null,"AC Unit"]
["B","Heating + Air Con","Daikin","WET UFH","YES","30 °C","Room Temp","Wired Controller",null,null,"G","Hot Water ON/OFF","Panasonic ",null,null,"28 °C",null,"Wired Controller"]
["B","Heating + Air Con","Daikin","WET UFH","YES","31 °C","Room Temp","Room Thimble Sensor",null,null,"H","Hot Water, Temp Control (Valve Only)","Fujitsu ",null,null,"29 °C",null,"ClimateSync Room Sensor"]
["B","Heating + Air Con","Daikin","WET UFH","YES","31 °C","Room Temp","AC Unit",null,null,"I","Hot Water, Temp Control (Valve & Boiler)","Hitachi ",null,null,"30 °C"]
["B","Heating + Air Con","Daikin","WET UFH","YES","31 °C","Room Temp","Wired Controller",null,null,"J","Heating + FCU","LG",null,null,"31 °C"]
["B","Heating + Air Con","Daikin","WET UFH","YES","32 °C","Room Temp","Room Thimble Sensor",null,null,"K","FCU Only","Other",null,null,"32 °C"]
["B","Heating + Air Con","Daikin","WET UFH","YES","32 °C","Room Temp","AC Unit",null,null,"L",{"$nulls":4},"33 °C"]
["B","Heating + Air Con","Daikin","WET UFH","YES","32 °C","Room Temp","Wired Controller",null,null,"M",{"$nulls":4},"34 °C"]
["B","Heating + Air Con","Daikin","WET UFH","YES","33 °C","Room Temp","Room Thimble Sensor",null,null,"N",{"$nulls":4},"35 °C"]
["B","Heating + Air Con","Daikin","WET UFH","YES","33 °C","Room Temp","AC Unit",null,null,"O",{"$nulls":4},"36 °C"]
["B","Heating + Air Con","Daikin","WET UFH","YES","33 °C","Room Temp","Wired Controller",null,null,"P",{"$nulls":4},"37 °C"]
["B","Heating + Air Con","Daikin","WET UFH","YES","34 °C","Room Temp","Room Thimble Sensor",null,null,"Q",{"$nulls":4},"38 °C"]
["B","Heating + Air Con","Daikin","WET UFH","YES","34 °C","Room Temp","AC Unit",null,null,"R",{"$nulls":4},"39 °C"]
["B","Heating + Air Con","Daikin","WET UFH","YES","34 °C","Room Temp","Wired Controller",null,null,"S",{"$nulls":4},"40 °C"]
["B","Heating + Air Con","Daikin","WET UFH","YES","35 °C","Room Temp","Room Thimble Sensor",null,null,"FA"]
["B","Heating + Air Con","Daikin","WET UFH","YES","35 °C","Room Temp","AC Unit",null,null,"FB"]
["B","Heating + Air Con","Daikin","WET UFH","YES","35 °C","Room Temp","Wired Controller",null,null,"FC"]
["B","Heating + Air Con","Daikin","WET UFH","YES","36 °C","Room Temp","Room Thimble Sensor",null,null,"FD"]
["B","Heating + Air Con","Daikin","WET UFH","YES","36 °C","Room Temp","AC Unit",null,null,"FE"]
["B","Heating + Air Con","Daikin","WET UFH","YES","36 °C","Room Temp","Wired Controller",null,null,"FF"]
["B","Heating + Air Con","Daikin","WET UFH","YES","37 °C","Room Temp","Room Thimble Sensor",null,null,"FAB"]
["B","Heating + Air Con","Daikin","WET UFH","YES","37 °C","Room Temp","AC Unit",null,null,"FBB"]
["B","Heating + Air Con","Daikin","WET UFH","YES","37 °C","Room Temp","Wired Controller",null,null,"FCB"]
["B","Heating + Air Con","Daikin","WET UFH","YES","38 °C","Room Temp","Room Thimble Sensor",null,null,"FDB"]
["B","Heating + Air Con","Daikin","WET UFH","YES","38 °C","Room Temp","AC Unit",null,null,"FEB"]
["B","Heating + Air Con","Daikin","WET UFH","YES","38 °C","Room Temp","Wired Controller",null,null,"FFB"]
["B","Heating + Air Con","Daikin","WET UFH","YES","39 °C","Room Temp","Room Thimble Sensor"]
["B","Heating + Air Con","Daikin","WET UFH","YES","39 °C","Room Temp","AC Unit"]
["B","Heating + Air Con","Daikin","WET UFH","YES","39 °C","Room Temp","Wired Controller"]
["B","Heating + Air Con","Daikin","WET UFH","YES","40 °C","Room Temp","Room Thimble Sensor"]
["B","Heating + Air Con","Daikin","WET UFH","YES","40 °C","Room Temp","AC Unit"]
["B","Heating + Air Con","Daikin","WET UFH","YES","40 °C","Room Temp","Wired Controller"]
["C","Heating + Air Con","Daikin","ELECTRIC UFH","NO","N/A","Room Temp","Room Thimble Sensor"]
["C","Heating + Air Con","Daikin","ELECTRIC UFH","NO","N/A","Room Temp","AC Unit"]
["C","Heating + Air Con","Daikin","ELECTRIC UFH","NO","N/A","Room Temp","Wired Controller"]
["D","Heating + Air Con","Daikin","ELECTRIC UFH","YES","TBA","Room Temp","Room Thimble Sensor"]
["D","Heating + Air Con","Daikin","ELECTRIC UFH","YES","TBA","Room Temp","AC Unit"]
["D","Heating + Air Con","Daikin","ELECTRIC UFH","YES","TBA","Room Temp","Wired Controller"]
["D","Heating + Air Con","Daikin","ELECTRIC UFH","YES","25 °C","Room Temp","Room Thimble Sensor"]
["D","Heating + Air Con","Daikin","ELECTRIC UFH","YES","25 °C","Room Temp","AC Unit"]
["D","Heating + Air Con","Daikin","ELECTRIC UFH","YES","25 °C","Room Temp","Wired Controller"]
["D","Heating + Air Con","Daikin","ELECTRIC UFH","YES","26 °C","Room Temp","Room Thimble Sensor"]
["D","Heating + Air Con","Daikin","ELECTRIC UFH","YES","26 °C","Room Temp","AC Unit"]
["D","Heating + Air Con","Daikin","ELECTRIC UFH","YES","26 °C","Room Temp","Wired Controller"]
["D","Heating + Air Con","Daikin","ELECTRIC UFH","YES","27 °C","Room Temp","Room Thimble Sensor"]
["D","Heating + Air Con","Daikin","ELECTRIC UFH","YES","27 °C","Room Temp","AC Unit"]
["D","Heating + Air Con","Daikin","ELECTRIC UFH","YES","27 °C","Room Temp","Wired Controller"]
["D","Heating + Air Con","Daikin","ELECTRIC UFH","YES","28 °C","Room Temp","Room Thimble Sensor"]
["D","Heating + Air Con","Daikin","ELECTRIC UFH","YES","28 °C","Room Temp","AC Unit"]
["D","Heating + Air Con","Daikin","ELECTRIC UFH","YES","28 °C","Room Temp","Wired Controller"]
["D","Heating + Air Con","Daikin","ELECTRIC UFH","YES","29 °C","Room Temp","Room Thimble Sensor"]
["D","Heating + Air Con","Daikin","ELECTRIC UFH","YES","29 °C","Room Temp","AC Unit"]
["D","Heating + Air Con","Daikin","ELECTRIC UFH","YES","29 °C","Room Temp","Wired Controller"]
["D","Heating + Air Con","Daikin","ELECTRIC UFH","YES","30 °C","Room Temp","Room Thimble Sensor"]
["D","Heating + Air Con","Daikin","ELECTRIC UFH","YES","30 °C","Room Temp","AC Unit"]
["D","Heating + Air Con","Daikin","ELECTRIC UFH","YES","30 °C","Room Temp","Wired Controller"]
["D","Heating + Air Con","Daikin","ELECTRIC UFH","YES","31 °C","Room Temp","Room Thimble Sensor"]
["D","Heating + Air Con","Daikin","ELECTRIC UFH","YES","31 °C","Room Temp","AC Unit"]
["D","Heating + Air Con","Daikin","ELECTRIC UFH","YES","31 °C","Room Temp","Wired Controller"]
["D","Heating + Air Con","Daikin","ELECTRIC UFH","YES","32 °C","Room Temp","Room Thimble Sensor"]
["D","Heating + Air Con","Daikin","ELECTRIC UFH","YES","32 °C","Room Temp","AC Unit"]
["D","Heating + Air Con","Daikin","ELECTRIC UFH","YES","32 °C","Room Temp","Wired Controller"]
["D","Heating + Air Con","Daikin","ELECTRIC UFH","YES","33 °C","Room Temp","Room Thimble Sensor"]
["D","Heating + Air Con","Daikin","ELECTRIC UFH","YES","33 °C","Room Temp","AC Unit"]
["D","Heating + Air Con","Daikin","ELECTRIC UFH","YES","33 °C","Room Temp","Wired Controller"]
["D","Heating + Air Con","Daikin","ELECTRIC UFH","YES","34 °C","Room Temp","Room Thimble Sensor"]
["D","Heating + Air Con","Daikin","ELECTRIC UFH","YES","34 °C","Room Temp","AC Unit"]
["D","Heating + Air Con","Daikin","ELECTRIC UFH","YES","34 °C","Room Temp","Wired Controller"]
["D","Heating + Air Con","Daikin","ELECTRIC UFH","YES","35 °C","Room Temp","Room Thimble Sensor"]
["D","Heating + Air Con","Daikin","ELECTRIC UFH","YES","35 °C","Room Temp","AC Unit"]
["D","Heating + Air Con","Daikin","ELECTRIC UFH","YES","35 °C","Room Temp","Wired Controller"]
["D","Heating + Air Con","Daikin","ELECTRIC UFH","YES","36 °C","Room Temp","Room Thimble Sensor"]
["D","Heating + Air Con","Daikin","ELECTRIC UFH","YES","36 °C","Room Temp","AC Unit"]
["D","Heating + Air Con","Daikin","ELECTRIC UFH","YES","36 °C","Room Temp","Wired Controller"]
["D","Heating + Air Con","Daikin","ELECTRIC UFH","YES","37 °C","Room Temp","Room Thimble Sensor"]
["D","Heating + Air Con","Daikin","ELECTRIC UFH","YES","37 °C","Room Temp","AC Unit"]
["D","Heating + Air Con","Daikin","ELECTRIC UFH","YES","37 °C","Room Temp","Wired Controller"]
["D","Heating + Air Con","Daikin","ELECTRIC UFH","YES","38 °C","Room Temp","Room Thimble Sensor"]
["D","Heating + Air Con","Daikin","ELECTRIC UFH","YES","38 °C","Room Temp","AC Unit"]
["D","Heating + Air Con","Daikin","ELECTRIC UFH","YES","38 °C","Room Temp","Wired Controller"]
["D","Heating + Air Con","Daikin","ELECTRIC UFH","YES","39 °C","Room Temp","Room Thimble Sensor"]
["D","Heating + Air Con","Daikin","ELECTRIC UFH","YES","39 °C","Room Temp","AC Unit"]
["D","Heating + Air Con","Daikin","ELECTRIC UFH","YES","39 °C","Room Temp","Wired Controller"]
["D","Heating + Air Con","Daikin","ELECTRIC UFH","YES","40 °C","Room Temp","Room Thimble Sensor"]
["D","Heating + Air Con","Daikin","ELECTRIC UFH","YES","40 °C","Room Temp","AC Unit"]
["D","Heating + Air Con","Daikin","ELECTRIC UFH","YES","40 °C","Room Temp","Wired Controller"]
["E","Heating + Air Con","Daikin","RADIATOR","N/A","N/A","Room Temp","Room Thimble Sensor"]
["E","Heating + Air Con","Daikin","RADIATOR","N/A","N/A","Room Temp","AC Unit"]
["E","Heating + Air Con","Daikin","RADIATOR","N/A","N/A","Room Temp","Wired Controller"]
["A","Heating + Air Con","Mitsubishi","WET UFH","NO","N/A","Room Temp","Room Thimble Sensor"]
["A","Heating + Air Con","Mitsubishi","WET UFH","NO","N/A","Room Temp","AC Unit"]
["A","Heating + Air Con","Mitsubishi","WET UFH","NO","N/A","Room Temp","Wired Controller"]
["B","Heating + Air Con","Mitsubishi","WET UFH","YES","TBA","Room Temp","Room Thimble Sensor"]
["B","Heating + Air Con","Mitsubishi","WET UFH","YES","TBA","Room Temp","AC Unit"]
["B","Heating + Air Con","Mitsubishi","WET UFH","YES","TBA","Room Temp","Wired Controller"]
["B","Heating + Air Con","Mitsubishi","WET UFH","YES","25 °C","Room Temp","Room Thimble Sensor"]
["B","Heating + Air Con","Mitsubishi","WET UFH","YES","25 °C","Room Temp","AC Unit"]
["B","Heating + Air Con","Mitsubishi","WET UFH","YES","25 °C","Room Temp","Wired Controller"]
["B","Heating + Air Con","Mitsubishi","WET UFH","YES","26 °C","Room Temp","Room Thimble Sensor"]
["B","Heating + Air Con","Mitsubishi","WET UFH","YES","26 °C","Room Temp","AC Unit"]
["B","Heating + Air Con","Mitsubishi","WET UFH","YES","26 °C","Room Temp","Wired Controller"]
["B","Heating + Air Con","Mitsubishi","WET UFH","YES","27 °C","Room Temp","Room Thimble Sensor"]
["B","Heating + Air Con","Mitsubishi","WET UFH","YES","27 °C","Room Temp","AC Unit"]
["B","Heating + Air Con","Mitsubishi","WET UFH","YES","27 °C","Room Temp","Wired Controller"]
["B","Heating + Air Con","Mitsubishi","WET UFH","YES","28 °C","Room Temp","Room Thimble Sensor"]
["B","Heating + Air Con","Mitsubishi","WET UFH","YES","28 °C","Room Temp","AC Unit"]
["B","Heating + Air Con","Mitsubishi","WET UFH","YES","28 °C","Room Temp","Wired Controller"]
["B","Heating + Air Con","Mitsubishi","WET UFH","YES","29 °C","Room Temp","Room Thimble Sensor"]
["B","Heating + Air Con","Mitsubishi","WET UFH","YES","29 °C","Room Temp","AC Unit"]
["B","Heating + Air Con","Mitsubishi","WET UFH","YES","29 °C","Room Temp","Wired Controller"]
["B","Heating + Air Con","Mitsubishi","WET UFH","YES","30 °C","Room Temp","Room Thimble Sensor"]
["B","Heating + Air Con","Mitsubishi","WET UFH","YES","30 °C","Room Temp","AC Unit"]
["B","Heating + Air Con","Mitsubishi","WET UFH","YES","30 °C","Room Temp","Wired Controller"]
["B","Heating + Air Con","Mitsubishi","WET UFH","YES","31 °C","Room Temp","Room Thimble Sensor"]
["B","Heating + Air Con","Mitsubishi","WET UFH","YES","31 °C","Room Temp","AC Unit"]
["B","Heating + Air Con","Mitsubishi","WET UFH","YES","31 °C","Room Temp","Wired Controller"]
["B","Heating + Air Con","Mitsubishi","WET UFH","YES","32 °C","Room Temp","Room Thimble Sensor"]
["B","Heating + Air Con","Mitsubishi","WET UFH","YES","32 °C","Room Temp","AC Unit"]
["B","Heating + Air Con","Mitsubishi","WET UFH","YES","32 °C","Room Temp","Wired Controller"]
["B","Heating + Air Con","Mitsubishi","WET UFH","YES","33 °C","Room Temp","Room Thimble Sensor"]
["B","Heating + Air Con","Mitsubishi","WET UFH","YES","33 °C","Room Temp","AC Unit"]
["B","Heating + Air Con","Mitsubishi","WET UFH","YES","33 °C","Room Temp","Wired Controller"]
["B","Heating + Air Con","Mitsubishi","WET UFH","YES","34 °C","Room Temp","Room Thimble Sensor"]
["B","Heating + Air Con","Mitsubishi","WET UFH","YES","34 °C","Room Temp","AC Unit"]
["B","Heating + Air Con","Mitsubishi","WET UFH","YES","34 °C","Room Temp","Wired Controller"]
["B","Heating + Air Con","Mitsubishi","WET UFH","YES","35 °C","Room Temp","Room Thimble Sensor"]
["B","Heating + Air Con","Mitsubishi","WET UFH","YES","35 °C","Room Temp","AC Unit"]
["B","Heating + Air Con","Mitsubishi","WET UFH","YES","35 °C","Room Temp","Wired Controller"]
["B","Heating + Air Con","Mitsubishi","WET UFH","YES","36 °C","Room Temp","Room Thimble Sensor"]
["B","Heating + Air Con","Mitsubishi","WET UFH","YES","36 °C","Room Temp","AC Unit"]
["B","Heating + Air Con","Mitsubishi","WET UFH","YES","36 °C","Room Temp","Wired Controller"]
["B","Heating + Air Con","Mitsubishi","WET UFH","YES","37 °C","Room Temp","Room Thimble Sensor"]
["B","Heating + Air Con","Mitsubishi","WET UFH","YES","37 °C","Room Temp","AC Unit"]
["B","Heating + Air Con","Mitsubishi","WET UFH","YES","37 °C","Room Temp","Wired Controller"]
["B","Heating + Air Con","Mitsubishi","WET UFH","YES","38 °C","Room Temp","Room Thimble Sensor"]
["B","Heating + Air Con","Mitsubishi","WET UFH","YES","38 °C","Room Temp","AC Unit"]
["B","Heating + Air Con","Mitsubishi","WET UFH","YES","38 °C","Room Temp","Wired Controller"]
["B","Heating + Air Con","Mitsubishi","WET UFH","YES","39 °C","Room Temp","Room Thimble Sensor"]
["B","Heating + Air Con","Mitsubishi","WET UFH","YES","39 °C","Room Temp","AC Unit"]
["B","Heating + Air Con","Mitsubishi","WET UFH","YES","39 °C","Room Temp","Wired Controller"]
["B","Heating + Air Con","Mitsubishi","WET UFH","YES","40 °C","Room Temp","Room Thimble Sensor"]
["B","Heating + Air Con","Mitsubishi","WET UFH","YES","40 °C","Room Temp","AC Unit"]
["B","Heating + Air Con","Mitsubishi","WET UFH","YES","40 °C","Room Temp","Wired Controller"]
["C","Heating + Air Con","Mitsubishi","ELECTRIC UFH","NO","N/A","Room Temp","Room Thimble Sensor"]
["C","Heating + Air Con","Mitsubishi","ELECTRIC UFH","NO","N/A","Room Temp","AC Unit"]
["C","Heating + Air Con","Mitsubishi","ELECTRIC UFH","NO","N/A","Room Temp","Wired Controller"]
["D","Heating + Air Con","Mitsubishi","ELECTRIC UFH","YES","TBA","Room Temp","Room Thimble Sensor"]
["D","Heating + Air Con","Mitsubishi","ELECTRIC UFH","YES","TBA","Room Temp","AC Unit"]
["D","Heating + Air Con","Mitsubishi","ELECTRIC UFH","YES","TBA","Room Temp","Wired Controller"]
["D","Heating + Air Con","Mitsubishi","ELECTRIC UFH","YES","25 °C","Room Temp","Room Thimble Sensor"]
["D","Heating + Air Con","Mitsubishi","ELECTRIC UFH","YES","25 °C","Room Temp","AC Unit"]
["D","Heating + Air Con","Mitsubishi","ELECTRIC UFH","YES","25 °C","Room Temp","Wired Controller"]
["D","Heating + Air Con","Mitsubishi","ELECTRIC UFH","YES","26 °C","Room Temp","Room Thimble Sensor"]
["D","Heating + Air Con","Mitsubishi","ELECTRIC UFH","YES","26 °C","Room Temp","AC Unit"]
["D","Heating + Air Con","Mitsubishi","ELECTRIC UFH","YES","26 °C","Room Temp","Wired Controller"]
["D","Heating + Air Con","Mitsubishi","ELECTRIC UFH","YES","27 °C","Room Temp","Room Thimble Sensor"]
["D","Heating + Air Con","Mitsubishi","ELECTRIC UFH","YES","27 °C","Room Temp","AC Unit"]
["D","Heating + Air Con","Mitsubishi","ELECTRIC UFH","YES","27 °C","Room Temp","Wired Controller"]
["D","Heating + Air Con","Mitsubishi","ELECTRIC UFH","YES","28 °C","Room Temp","Room Thimble Sensor"]
["D","Heating + Air Con","Mitsubishi","ELECTRIC UFH","YES","28 °C","Room Temp","AC Unit"]
["D","Heating + Air Con","Mitsubishi","ELECTRIC UFH","YES","28 °C","Room Temp","Wired Controller"]
["D","Heating + Air Con","Mitsubishi","ELECTRIC UFH","YES","29 °C","Room Temp","Room Thimble Sensor"]
["D","Heating + Air Con","Mitsubishi","ELECTRIC UFH","YES","29 °C","Room Temp","AC Unit"]
["D","Heating + Air Con","Mitsubishi","ELECTRIC UFH","YES","29 °C","Room Temp","Wired Controller"]
["D","Heating + Air Con","Mitsubishi","ELECTRIC UFH","YES","30 °C","Room Temp","Room Thimble Sensor"]
["D","Heating + Air Con","Mitsubishi","ELECTRIC UFH","YES","30 °C","Room Temp","AC Unit"]
["D","Heating + Air Con","Mitsubishi","ELECTRIC UFH","YES","30 °C","Room Temp","Wired Controller"]
["D","Heating + Air Con","Mitsubishi","ELECTRIC UFH","YES","31 °C","Room Temp","Room Thimble Sensor"]
["D","Heating + Air Con","Mitsubishi","ELECTRIC UFH","YES","31 °C","Room Temp","AC Unit"]
["D","Heating + Air Con","Mitsubishi","ELECTRIC UFH","YES","31 °C","Room Temp","Wired Controller"]
["D","Heating + Air Con","Mitsubishi","ELECTRIC UFH","YES","32 °C","Room Temp","Room Thimble Sensor"]
["D","Heating + Air Con","Mitsubishi","ELECTRIC UFH","YES","32 °C","Room Temp","AC Unit"]
["D","Heating + Air Con","Mitsubishi","ELECTRIC UFH","YES","32 °C","Room Temp","Wired Controller"]
["D","Heating + Air Con","Mitsubishi","ELECTRIC UFH","YES","33 °C","Room Temp","Room Thimble Sensor"]
["D","Heating + Air Con","Mitsubishi","ELECTRIC UFH","YES","33 °C","Room Temp","AC Unit"]
["D","Heating + Air Con","Mitsubishi","ELECTRIC UFH","YES","33 °C","Room Temp","Wired Controller"]
["D","Heating + Air Con","Mitsubishi","ELECTRIC UFH","YES","34 °C","Room Temp","Room Thimble Sensor"]
["D","Heating + Air Con","Mitsubishi","ELECTRIC UFH","YES","34 °C","Room Temp","AC Unit"]
["D","Heating + Air Con","Mitsubishi","ELECTRIC UFH","YES","34 °C","Room Temp","Wired Controller"]
["D","Heating + Air Con","Mitsubishi","ELECTRIC UFH","YES","35 °C","Room Temp","Room Thimble Sensor"]
["D","Heating + Air Con","Mitsubishi","ELECTRIC UFH","YES","35 °C","Room Temp","AC Unit"]
["D","Heating + Air Con","Mitsubishi","ELECTRIC UFH","YES","35 °C","Room Temp","Wired Controller"]
["D","Heating + Air Con","Mitsubishi","ELECTRIC UFH","YES","36 °C","Room Temp","Room Thimble Sensor"]
["D","Heating + Air Con","Mitsubishi","ELECTRIC UFH","YES","36 °C","Room Temp","AC Unit"]
["D","Heating + Air Con","Mitsubishi","ELECTRIC UFH","YES","36 °C","Room Temp","Wired Controller"]
["D","Heating + Air Con","Mitsubishi","ELECTRIC UFH","YES","37 °C","Room Temp","Room Thimble Sensor"]
["D","Heating + Air Con","Mitsubishi","ELECTRIC UFH","YES","37 °C","Room Temp","AC Unit"]
["D","Heating + Air Con","Mitsubishi","ELECTRIC UFH","YES","37 °C","Room Temp","Wired Controller"]
["D","Heating + Air Con","Mitsubishi","ELECTRIC UFH","YES","38 °C","Room Temp","Room Thimble Sensor"]
["D","Heating + Air Con","Mitsubishi","ELECTRIC UFH","YES","38 °C","Room Temp","AC Unit"]
["D","Heating + Air Con","Mitsubishi","ELECTRIC UFH","YES","38 °C","Room Temp","Wired Controller"]
["D","Heating + Air Con","Mitsubishi","ELECTRIC UFH","YES","39 °C","Room Temp","Room Thimble Sensor"]
["D","Heating + Air Con","Mitsubishi","ELECTRIC UFH","YES","39 °C","Room Temp","AC Unit"]
["D","Heating + Air Con","Mitsubishi","ELECTRIC UFH","YES","39 °C","Room Temp","Wired Controller"]
["D","Heating + Air Con","Mitsubishi","ELECTRIC UFH","YES","40 °C","Room Temp","Room Thimble Sensor"]
["D","Heating + Air Con","Mitsubishi","ELECTRIC UFH","YES","40 °C","Room Temp","AC Unit"]
["D","Heating + Air Con","Mitsubishi","ELECTRIC UFH","YES","40 °C","Room Temp","Wired Controller"]
["E","Heating + Air Con","Mitsubishi","RADIATOR","N/A","N/A","Room Temp","Room Thimble Sensor"]
["E","Heating + Air Con","Mitsubishi","RADIATOR","N/A","N/A","Room Temp","AC Unit"]
["E","Heating + Air Con","Mitsubishi","RADIATOR","N/A","N/A","Room Temp","Wired Controller"]
["A","Heating + Air Con","Toshiba","WET UFH","NO","N/A","Room Temp","Room Thimble Sensor"]
["A","Heating + Air Con","Toshiba","WET UFH","NO","N/A","Room Temp","AC Unit"]
["A","Heating + Air Con","Toshiba","WET UFH","NO","N/A","Room Temp","Wired Controller"]
["B","Heating + Air Con","Toshiba","WET UFH","YES","TBA","Room Temp","Room Thimble Sensor"]
["B","Heating + Air Con","Toshiba","WET UFH","YES","TBA","Room Temp","AC Unit"]
["B","Heating + Air Con","Toshiba","WET UFH","YES","TBA","Room Temp","Wired Controller"]
["B","Heating + Air Con","Toshiba","WET UFH","YES","25 °C","Room Temp","Room Thimble Sensor"]
["B","Heating + Air Con","Toshiba","WET UFH","YES","25 °C","Room Temp","AC Unit"]
["B","Heating + Air Con","Toshiba","WET UFH","YES","25 °C","Room Temp","Wired Controller"]
["B","Heating + Air Con","Toshiba","WET UFH","YES","26 °C","Room Temp","Room Thimble Sensor"]
["B","Heating + Air Con","Toshiba","WET UFH","YES","26 °C","Room Temp","AC Unit"]
["B","Heating + Air Con","Toshiba","WET UFH","YES","26 °C","Room Temp","Wired Controller"]
["B","Heating + Air Con","Toshiba","WET UFH","YES","27 °C","Room Temp","Room Thimble Sensor"]
["B","Heating + Air Con","Toshiba","WET UFH","YES","27 °C","Room Temp","AC Unit"]
["B","Heating + Air Con","Toshiba","WET UFH","YES","27 °C","Room Temp","Wired Controller"]
["B","Heating + Air Con","Toshiba","WET UFH","YES","28 °C","Room Temp","Room Thimble Sensor"]
["B","Heating + Air Con","Toshiba","WET UFH","YES","28 °C","Room Temp","AC Unit"]
["B","Heating + Air Con","Toshiba","WET UFH","YES","28 °C","Room Temp","Wired Controller"]
["B","Heating + Air Con","Toshiba","WET UFH","YES","29 °C","Room Temp","Room Thimble Sensor"]
["B","Heating + Air Con","Toshiba","WET UFH","YES","29 °C","Room Temp","AC Unit"]
["B","Heating + Air Con","Toshiba","WET UFH","YES","29 °C","Room Temp","Wired Controller"]
["B","Heating + Air Con","Toshiba","WET UFH","YES","30 °C","Room Temp","Room Thimble Sensor"]
["B","Heating + Air Con","Toshiba","WET UFH","YES","30 °C","Room Temp","AC Unit"]
["B","Heating + Air Con","Toshiba","WET UFH","YES","30 °C","Room Temp","Wired Controller"]
["B","Heating + Air Con","Toshiba","WET UFH","YES","31 °C","Room Temp","Room Thimble Sensor"]
["B","Heating + Air Con","Toshiba","WET UFH","YES","31 °C","Room Temp","AC Unit"]
["B","Heating + Air Con","Toshiba","WET UFH","YES","31 °C","Room Temp","Wired Controller"]
["B","Heating + Air Con","Toshiba","WET UFH","YES","32 °C","Room Temp","Room Thimble Sensor"]
["B","Heating + Air Con","Toshiba","WET UFH","YES","32 °C","Room Temp","AC Unit"]
["B","Heating + Air Con","Toshiba","WET UFH","YES","32 °C","Room Temp","Wired Controller"]
["B","Heating + Air Con","Toshiba","WET UFH","YES","33 °C","Room Temp","Room Thimble Sensor"]
["B","Heating + Air Con","Toshiba","WET UFH","YES","33 °C","Room Temp","AC Unit"]
["B","Heating + Air Con","Toshiba","WET UFH","YES","33 °C","Room Temp","Wired Controller"]
["B","Heating + Air Con","Toshiba","WET UFH","YES","34 °C","Room Temp","Room Thimble Sensor"]
["B","Heating + Air Con","Toshiba","WET UFH","YES","34 °C","Room Temp","AC Unit"]
["B","Heating + Air Con","Toshiba","WET UFH","YES","34 °C","Room Temp","Wired Controller"]
["B","Heating + Air Con","Toshiba","WET UFH","YES","35 °C","Room Temp","Room Thimble Sensor"]
["B","Heating + Air Con","Toshiba","WET UFH","YES","35 °C","Room Temp","AC Unit"]
["B","Heating + Air Con","Toshiba","WET UFH","YES","35 °C","Room Temp","Wired Controller"]
["B","Heating + Air Con","Toshiba","WET UFH","YES","36 °C","Room Temp","Room Thimble Sensor"]
["B","Heating + Air Con","Toshiba","WET UFH","YES","36 °C","Room Temp","AC Unit"]
["B","Heating + Air Con","Toshiba","WET UFH","YES","36 °C","Room Temp","Wired Controller"]
["B","Heating + Air Con","Toshiba","WET UFH","YES","37 °C","Room Temp","Room Thimble Sensor"]
["B","Heating + Air Con","Toshiba","WET UFH","YES","37 °C","Room Temp","AC Unit"]
["B","Heating + Air Con","Toshiba","WET UFH","YES","37 °C","Room Temp","Wired Controller"]
["B","Heating + Air Con","Toshiba","WET UFH","YES","38 °C","Room Temp","Room Thimble Sensor"]
["B","Heating + Air Con","Toshiba","WET UFH","YES","38 °C","Room Temp","AC Unit"]
["B","Heating + Air Con","Toshiba","WET UFH","YES","38 °C","Room Temp","Wired Controller"]
["B","Heating + Air Con","Toshiba","WET UFH","YES","39 °C","Room Temp","Room Thimble Sensor"]
["B","Heating + Air Con","Toshiba","WET UFH","YES","39 °C","Room Temp","AC Unit"]
["B","Heating + Air Con","Toshiba","WET UFH","YES","39 °C","Room Temp","Wired Controller"]
["B","Heating + Air Con","Toshiba","WET UFH","YES","40 °C","Room Temp","Room Thimble Sensor"]
["B","Heating + Air Con","Toshiba","WET UFH","YES","40 °C","Room Temp","AC Unit"]
["B","Heating + Air Con","Toshiba","WET UFH","YES","40 °C","Room Temp","Wired Controller"]
["C","Heating + Air Con","Toshiba","ELECTRIC UFH","NO","N/A","Room Temp","Room Thimble Sensor"]
["C","Heating + Air Con","Toshiba","ELECTRIC UFH","NO","N/A","Room Temp","AC Unit"]
["C","Heating + Air Con","Toshiba","ELECTRIC UFH","NO","N/A","Room Temp","Wired Controller"]
["D","Heating + Air Con","Toshiba","ELECTRIC UFH","YES","TBA","Room Temp","Room Thimble Sensor"]
["D","Heating + Air Con","Toshiba","ELECTRIC UFH","YES","TBA","Room Temp","AC Unit"]
["D","Heating + Air Con","Toshiba","ELECTRIC UFH","YES","TBA","Room Temp","Wired Controller"]
["D","Heating + Air Con","Toshiba","ELECTRIC UFH","YES","25 °C","Room Temp","Room Thimble Sensor"]
["D","Heating + Air Con","Toshiba","ELECTRIC UFH","YES","25 °C","Room Temp","AC Unit"]
["D","Heating + Air Con","Toshiba","ELECTRIC UFH","YES","25 °C","Room Temp","Wired Controller"]
["D","Heating + Air Con","Toshiba","ELECTRIC UFH","YES","26 °C","Room Temp","Room Thimble Sensor"]
["D","Heating + Air Con","Toshiba","ELECTRIC UFH","YES","26 °C","Room Temp","AC Unit"]
["D","Heating + Air Con","Toshiba","ELECTRIC UFH","YES","26 °C","Room Temp","Wired Controller"]
["D","Heating + Air Con","Toshiba","ELECTRIC UFH","YES","27 °C","Room Temp","Room Thimble Sensor"]
["D","Heating + Air Con","Toshiba","ELECTRIC UFH","YES","27 °C","Room Temp","AC Unit"]
["D","Heating + Air Con","Toshiba","ELECTRIC UFH","YES","27 °C","Room Temp","Wired Controller"]
["D","Heating + Air Con","Toshiba","ELECTRIC UFH","YES","28 °C","Room Temp","Room Thimble Sensor"]
["D","Heating + Air Con","Toshiba","ELECTRIC UFH","YES","28 °C","Room Temp","AC Unit"]
["D","Heating + Air Con","Toshiba","ELECTRIC UFH","YES","28 °C","Room Temp","Wired Controller"]
["D","Heating + Air Con","Toshiba","ELECTRIC UFH","YES","29 °C","Room Temp","Room Thimble Sensor"]
["D","Heating + Air Con","Toshiba","ELECTRIC UFH","YES","29 °C","Room Temp","AC Unit"]
["D","Heating + Air Con","Toshiba","ELECTRIC UFH","YES","29 °C","Room Temp","Wired Controller"]
["D","Heating + Air Con","Toshiba","ELECTRIC UFH","YES","30 °C","Room Temp","Room Thimble Sensor"]
["D","Heating + Air Con","Toshiba","ELECTRIC UFH","YES","30 °C","Room Temp","AC Unit"]
["D","Heating + Air Con","Toshiba","ELECTRIC UFH","YES","30 °C","Room Temp","Wired Controller"]
["D","Heating + Air Con","Toshiba","ELECTRIC UFH","YES","31 °C","Room Temp","Room Thimble Sensor"]
["D","Heating + Air Con","Toshiba","ELECTRIC UFH","YES","31 °C","Room Temp","AC Unit"]
["D","Heating + Air Con","Toshiba","ELECTRIC UFH","YES","31 °C","Room Temp","Wired Controller"]
["D","Heating + Air Con","Toshiba","ELECTRIC UFH","YES","32 °C","Room Temp","Room Thimble Sensor"]
["D","Heating + Air Con","Toshiba","ELECTRIC UFH","YES","32 °C","Room Temp","AC Unit"]
["D","Heating + Air Con","Toshiba","ELECTRIC UFH","YES","32 °C","Room Temp","Wired Controller"]
["D","Heating + Air Con","Toshiba","ELECTRIC UFH","YES","33 °C","Room Temp","Room Thimble Sensor"]
["D","Heating + Air Con","Toshiba","ELECTRIC UFH","YES","33 °C","Room Temp","AC Unit"]
["D","Heating + Air Con","Toshiba","ELECTRIC UFH","YES","33 °C","Room Temp","Wired Controller"]
["D","Heating + Air Con","Toshiba","ELECTRIC UFH","YES","34 °C","Room Temp","Room Thimble Sensor"]
["D","Heating + Air Con","Toshiba","ELECTRIC UFH","YES","34 °C","Room Temp","AC Unit"]
["D","Heating + Air Con","Toshiba","ELECTRIC UFH","YES","34 °C","Room Temp","Wired Controller"]
["D","Heating + Air Con","Toshiba","ELECTRIC UFH","YES","35 °C","Room Temp","Room Thimble Sensor"]
["D","Heating + Air Con","Toshiba","ELECTRIC UFH","YES","35 °C","Room Temp","AC Unit"]
["D","Heating + Air Con","Toshiba","ELECTRIC UFH","YES","35 °C","Room Temp","Wired Controller"]
["D","Heating + Air Con","Toshiba","ELECTRIC UFH","YES","36 °C","Room Temp","Room Thimble Sensor"]
["D","Heating + Air Con","Toshiba","ELECTRIC UFH","YES","36 °C","Room Temp","AC Unit"]
["D","Heating + Air Con","Toshiba","ELECTRIC UFH","YES","36 °C","Room Temp","Wired Controller"]
["D","Heating + Air Con","Toshiba","ELECTRIC UFH","YES","37 °C","Room Temp","Room Thimble Sensor"]
["D","Heating + Air Con","Toshiba","ELECTRIC UFH","YES","37 °C","Room Temp","AC Unit"]
["D","Heating + Air Con","Toshiba","ELECTRIC UFH","YES","37 °C","Room Temp","Wired Controller"]
["D","Heating + Air Con","Toshiba","ELECTRIC UFH","YES","38 °C","Room Temp","Room Thimble Sensor"]
["D","Heating + Air Con","Toshiba","ELECTRIC UFH","YES","38 °C","Room Temp","AC Unit"]
["D","Heating + Air Con","Toshiba","ELECTRIC UFH","YES","38 °C","Room Temp","Wired Controller"]
["D","Heating + Air Con","Toshiba","ELECTRIC UFH","YES","39 °C","Room Temp","Room Thimble Sensor"]
["D","Heating + Air Con","Toshiba","ELECTRIC UFH","YES","39 °C","Room Temp","AC Unit"]
["D","Heating + Air Con","Toshiba","ELECTRIC UFH","YES","39 °C","Room Temp","Wired Controller"]
["D","Heating + Air Con","Toshiba","ELECTRIC UFH","YES","40 °C","Room Temp","Room Thimble Sensor"]
["D","Heating + Air Con","Toshiba","ELECTRIC UFH","YES","40 °C","Room Temp","AC Unit"]
["D","Heating + Air Con","Toshiba","ELECTRIC UFH","YES","40 °C","Room Temp","Wired Controller"]
["E","Heating + Air Con","Toshiba","RADIATOR","N/A","N/A","Room Temp","Room Thimble Sensor"]
["E","Heating + Air Con","Toshiba","RADIATOR","N/A","N/A","Room Temp","AC Unit"]
["E","Heating + Air Con","Toshiba","RADIATOR","N/A","N/A","Room Temp","Wired Controller"]
["A","Heating + Air Con","Sanyo ","WET UFH","NO","N/A","Room Temp","Room Thimble Sensor"]
["A","Heating + Air Con","Sanyo ","WET UFH","NO","N/A","Room Temp","AC Unit"]
["A","Heating + Air Con","Sanyo ","WET UFH","NO","N/A","Room Temp","Wired Controller"]
["B","Heating + Air Con","Sanyo ","WET UFH","YES","TBA","Room Temp","Room Thimble Sensor"]
["B","Heating + Air Con","Sanyo ","WET UFH","YES","TBA","Room Temp","AC Unit"]
["B","Heating + Air Con","Sanyo ","WET UFH","YES","TBA","Room Temp","Wired Controller"]
["B","Heating + Air Con","Sanyo ","WET UFH","YES","25 °C","Room Temp","Room Thimble Sensor"]
["B","Heating + Air Con","Sanyo ","WET UFH","YES","25 °C","Room Temp","AC Unit"]
["B","Heating + Air Con","Sanyo ","WET UFH","YES","25 °C","Room Temp","Wired Controller"]
["B","Heating + Air Con","Sanyo ","WET UFH","YES","26 °C","Room Temp","Room Thimble Sensor"]
["B","Heating + Air Con","Sanyo ","WET UFH","YES","26 °C","Room Temp","AC Unit"]
["B","Heating + Air Con","Sanyo ","WET UFH","YES","26 °C","Room Temp","Wired Controller"]
["B","Heating + Air Con","Sanyo ","WET UFH","YES","27 °C","Room Temp","Room Thimble Sensor"]
["B","Heating + Air Con","Sanyo ","WET UFH","YES","27 °C","Room Temp","AC Unit"]
["B","Heating + Air Con","Sanyo ","WET UFH","YES","27 °C","Room Temp","Wired Controller"]
["B","Heating + Air Con","Sanyo ","WET UFH","YES","28 °C","Room Temp","Room Thimble Sensor"]
["B","Heating + Air Con","Sanyo ","WET UFH","YES","28 °C","Room Temp","AC Unit"]
["B","Heating + Air Con","Sanyo ","WET UFH","YES","28 °C","Room Temp","Wired Controller"]
["B","Heating + Air Con","Sanyo ","WET UFH","YES","29 °C","Room Temp","Room Thimble Sensor"]
["B","Heating + Air Con","Sanyo ","WET UFH","YES","29 °C","Room Temp","AC Unit"]
["B","Heating + Air Con","Sanyo ","WET UFH","YES","29 °C","Room Temp","Wired Controller"]
["B","Heating + Air Con","Sanyo ","WET UFH","YES","30 °C","Room Temp","Room Thimble Sensor"]
["B","Heating + Air Con","Sanyo ","WET UFH","YES","30 °C","Room Temp","AC Unit"]
["B","Heating + Air Con","Sanyo ","WET UFH","YES","30 °C","Room Temp","Wired Controller"]
["B","Heating + Air Con","Sanyo ","WET UFH","YES","31 °C","Room Temp","Room Thimble Sensor"]
["B","Heating + Air Con","Sanyo ","WET UFH","YES","31 °C","Room Temp","AC Unit"]
["B","Heating + Air Con","Sanyo ","WET UFH","YES","31 °C","Room Temp","Wired Controller"]
["B","Heating + Air Con","Sanyo ","WET UFH","YES","32 °C","Room Temp","Room Thimble Sensor"]
["B","Heating + Air Con","Sanyo ","WET UFH","YES","32 °C","Room Temp","AC Unit"]
["B","Heating + Air Con","Sanyo ","WET UFH","YES","32 °C","Room Temp","Wired Controller"]
["B","Heating + Air Con","Sanyo ","WET UFH","YES","33 °C","Room Temp","Room Thimble Sensor"]
["B","Heating + Air Con","Sanyo ","WET UFH","YES","33 °C","Room Temp","AC Unit"]
["B","Heating + Air Con","Sanyo ","WET UFH","YES","33 °C","Room Temp","Wired Controller"]
["B","Heating + Air Con","Sanyo ","WET UFH","YES","34 °C","Room Temp","Room Thimble Sensor"]
["B","Heating + Air Con","Sanyo ","WET UFH","YES","34 °C","Room Temp","AC Unit"]
["B","Heating + Air Con","Sanyo ","WET UFH","YES","34 °C","Room Temp","Wired Controller"]
["B","Heating + Air Con","Sanyo ","WET UFH","YES","35 °C","Room Temp","Room Thimble Sensor"]
["B","Heating + Air Con","Sanyo ","WET UFH","YES","35 °C","Room Temp","AC Unit"]
["B","Heating + Air Con","Sanyo ","WET UFH","YES","35 °C","Room Temp","Wired Controller"]
["B","Heating + Air Con","Sanyo ","WET UFH","YES","36 °C","Room Temp","Room Thimble Sensor"]
["B","Heating + Air Con","Sanyo ","WET UFH","YES","36 °C","Room Temp","AC Unit"]
["B","Heating + Air Con","Sanyo ","WET UFH","YES","36 °C","Room Temp","Wired Controller"]
["B","Heating + Air Con","Sanyo ","WET UFH","YES","37 °C","Room Temp","Room Thimble Sensor"]
["B","Heating + Air Con","Sanyo ","WET UFH","YES","37 °C","Room Temp","AC Unit"]
["B","Heating + Air Con","Sanyo ","WET UFH","YES","37 °C","Room Temp","Wired Controller"]
["B","Heating + Air Con","Sanyo ","WET UFH","YES","38 °C","Room Temp","Room Thimble Sensor"]
["B","Heating + Air Con","Sanyo ","WET UFH","YES","38 °C","Room Temp","AC Unit"]
["B","Heating + Air Con","Sanyo ","WET UFH","YES","38 °C","Room Temp","Wired Controller"]
["B","Heating + Air Con","Sanyo ","WET UFH","YES","39 °C","Room Temp","Room Thimble Sensor"]
["B","Heating + Air Con","Sanyo ","WET UFH","YES","39 °C","Room Temp","AC Unit"]
["B","Heating + Air Con","Sanyo ","WET UFH","YES","39 °C","Room Temp","Wired Controller"]
["B","Heating + Air Con","Sanyo ","WET UFH","YES","40 °C","Room Temp","Room Thimble Sensor"]
["B","Heating + Air Con","Sanyo ","WET UFH","YES","40 °C","Room Temp","AC Unit"]
["B","Heating + Air Con","Sanyo ","WET UFH","YES","40 °C","Room Temp","Wired Controller"]
["C","Heating + Air Con","Sanyo ","ELECTRIC UFH","NO","N/A","Room Temp","Room Thimble Sensor"]
["C","Heating + Air Con","Sanyo ","ELECTRIC UFH","NO","N/A","Room Temp","AC Unit"]
["C","Heating + Air Con","Sanyo ","ELECTRIC UFH","NO","N/A","Room Temp","Wired Controller"]
["D","Heating + Air Con","Sanyo ","ELECTRIC UFH","YES","TBA","Room Temp","Room Thimble Sensor"]
["D","Heating + Air Con","Sanyo ","ELECTRIC UFH","YES","TBA","Room Temp","AC Unit"]
["D","Heating + Air Con","Sanyo ","ELECTRIC UFH","YES","TBA","Room Temp","Wired Controller"]
["D","Heating + Air Con","Sanyo ","ELECTRIC UFH","YES","25 °C","Room Temp","Room Thimble Sensor"]
["D","Heating + Air Con","Sanyo ","ELECTRIC UFH","YES","25 °C","Room Temp","AC Unit"]
["D","Heating + Air Con","Sanyo ","ELECTRIC UFH","YES","25 °C","Room Temp","Wired Controller"]
["D","Heating + Air Con","Sanyo ","ELECTRIC UFH","YES","26 °C","Room Temp","Room Thimble Sensor"]
["D","Heating + Air Con","Sanyo ","ELECTRIC UFH","YES","26 °C","Room Temp","AC Unit"]
["D","Heating + Air Con","Sanyo ","ELECTRIC UFH","YES","26 °C","Room Temp","Wired Controller"]
["D","Heating + Air Con","Sanyo ","ELECTRIC UFH","YES","27 °C","Room Temp","Room Thimble Sensor"]
["D","Heating + Air Con","Sanyo ","ELECTRIC UFH","YES","27 °C","Room Temp","AC Unit"]
["D","Heating + Air Con","Sanyo ","ELECTRIC UFH","YES","27 °C","Room Temp","Wired Controller"]
["D","Heating + Air Con","Sanyo ","ELECTRIC UFH","YES","28 °C","Room Temp","Room Thimble Sensor"]
["D","Heating + Air Con","Sanyo ","ELECTRIC UFH","YES","28 °C","Room Temp","AC Unit"]
["D","Heating + Air Con","Sanyo ","ELECTRIC UFH","YES","28 °C","Room Temp","Wired Controller"]
["D","Heating + Air Con","Sanyo ","ELECTRIC UFH","YES","29 °C","Room Temp","Room Thimble Sensor"]
["D","Heating + Air Con","Sanyo ","ELECTRIC UFH","YES","29 °C","Room Temp","AC Unit"]
["D","Heating + Air Con","Sanyo ","ELECTRIC UFH","YES","29 °C","Room Temp","Wired Controller"]
["D","Heating + Air Con","Sanyo ","ELECTRIC UFH","YES","30 °C","Room Temp","Room Thimble Sensor"]
["D","Heating + Air Con","Sanyo ","ELECTRIC UFH","YES","30 °C","Room Temp","AC Unit"]
["D","Heating + Air Con","Sanyo ","ELECTRIC UFH","YES","30 °C","Room Temp","Wired Controller"]
["D","Heating + Air Con","Sanyo ","ELECTRIC UFH","YES","31 °C","Room Temp","Room Thimble Sensor"]
["D","Heating + Air Con","Sanyo ","ELECTRIC UFH","YES","31 °C","Room Temp","AC Unit"]
["D","Heating + Air Con","Sanyo ","ELECTRIC UFH","YES","31 °C","Room Temp","Wired Controller"]
["D","Heating + Air Con","Sanyo ","ELECTRIC UFH","YES","32 °C","Room Temp","Room Thimble Sensor"]
["D","Heating + Air Con","Sanyo ","ELECTRIC UFH","YES","32 °C","Room Temp","AC Unit"]
["D","Heating + Air Con","Sanyo ","ELECTRIC UFH","YES","32 °C","Room Temp","Wired Controller"]
["D","Heating + Air Con","Sanyo ","ELECTRIC UFH","YES","33 °C","Room Temp","Room Thimble Sensor"]
["D","Heating + Air Con","Sanyo ","ELECTRIC UFH","YES","33 °C","Room Temp","AC Unit"]
["D","Heating + Air Con","Sanyo ","ELECTRIC UFH","YES","33 °C","Room Temp","Wired Controller"]
["D","Heating + Air Con","Sanyo ","ELECTRIC UFH","YES","34 °C","Room Temp","Room Thimble Sensor"]
["D","Heating + Air Con","Sanyo ","ELECTRIC UFH","YES","34 °C","Room Temp","AC Unit"]
["D","Heating + Air Con","Sanyo ","ELECTRIC UFH","YES","34 °C","Room Temp","Wired Controller"]
["D","Heating + Air Con","Sanyo ","ELECTRIC UFH","YES","35 °C","Room Temp","Room Thimble Sensor"]
["D","Heating + Air Con","Sanyo ","ELECTRIC UFH","YES","35 °C","Room Temp","AC Unit"]
["D","Heating + Air Con","Sanyo ","ELECTRIC UFH","YES","35 °C","Room Temp","Wired Controller"]
["D","Heating + Air Con","Sanyo ","ELECTRIC UFH","YES","36 °C","Room Temp","Room Thimble Sensor"]
["D","Heating + Air Con","Sanyo ","ELECTRIC UFH","YES","36 °C","Room Temp","AC Unit"]
["D","Heating + Air Con","Sanyo ","ELECTRIC UFH","YES","36 °C","Room Temp","Wired Controller"]
["D","Heating + Air Con","Sanyo ","ELECTRIC UFH","YES","37 °C","Room Temp","Room Thimble Sensor"]
["D","Heating + Air Con","Sanyo ","ELECTRIC UFH","YES","37 °C","Room Temp","AC Unit"]
["D","Heating + Air Con","Sanyo ","ELECTRIC UFH","YES","37 °C","Room Temp","Wired Controller"]
["D","Heating + Air Con","Sanyo ","ELECTRIC UFH","YES","38 °C","Room Temp","Room Thimble Sensor"]
["D","Heating + Air Con","Sanyo ","ELECTRIC UFH","YES","38 °C","Room Temp","AC Unit"]
["D","Heating + Air Con","Sanyo ","ELECTRIC UFH","YES","38 °C","Room Temp","Wired Controller"]
["D","Heating + Air Con","Sanyo ","ELECTRIC UFH","YES","39 °C","Room Temp","Room Thimble Sensor"]
["D","Heating + Air Con","Sanyo ","ELECTRIC UFH","YES","39 °C","Room Temp","AC Unit"]
["D","Heating + Air Con","Sanyo ","ELECTRIC UFH","YES","39 °C","Room Temp","Wired Controller"]
["D","Heating + Air Con","Sanyo ","ELECTRIC UFH","YES","40 °C","Room Temp","Room Thimble Sensor"]
["D","Heating + Air Con","Sanyo ","ELECTRIC UFH","YES","40 °C","Room Temp","AC Unit"]
["D","Heating + Air Con","Sanyo ","ELECTRIC UFH","YES","40 °C","Room Temp","Wired Controller"]
["E","Heating + Air Con","Sanyo ","RADIATOR","N/A","N/A","Room Temp","Room Thimble Sensor"]
["E","Heating + Air Con","Sanyo ","RADIATOR","N/A","N/A","Room Temp","AC Unit"]
["E","Heating + Air Con","Sanyo ","RADIATOR","N/A","N/A","Room Temp","Wired Controller"]
["A","Heating + Air Con","Panasonic ","WET UFH","NO","N/A","Room Temp","Room Thimble Sensor"]
["A","Heating + Air Con","Panasonic ","WET UFH","NO","N/A","Room Temp","AC Unit"]
["A","Heating + Air Con","Panasonic ","WET UFH","NO","N/A","Room Temp","Wired Controller"]
["B","Heating + Air Con","Panasonic ","WET UFH","YES","TBA","Room Temp","Room Thimble Sensor"]
["B","Heating + Air Con","Panasonic ","WET UFH","YES","TBA","Room Temp","AC Unit"]
["B","Heating + Air Con","Panasonic ","WET UFH","YES","TBA","Room Temp","Wired Controller"]
["B","Heating + Air Con","Panasonic ","WET UFH","YES","25 °C","Room Temp","Room Thimble Sensor"]
["B","Heating + Air Con","Panasonic ","WET UFH","YES","25 °C","Room Temp","AC Unit"]
["B","Heating + Air Con","Panasonic ","WET UFH","YES","25 °C","Room Temp","Wired Controller"]
["B","Heating + Air Con","Panasonic ","WET UFH","YES","26 °C","Room Temp","Room Thimble Sensor"]
["B","Heating + Air Con","Panasonic ","WET UFH","YES","26 °C","Room Temp","AC Unit"]
["B","Heating + Air Con","Panasonic ","WET UFH","YES","26 °C","Room Temp","Wired Controller"]
["B","Heating + Air Con","Panasonic ","WET UFH","YES","27 °C","Room Temp","Room Thimble Sensor"]
["B","Heating + Air Con","Panasonic ","WET UFH","YES","27 °C","Room Temp","AC Unit"]
["B","Heating + Air Con","Panasonic ","WET UFH","YES","27 °C","Room Temp","Wired Controller"]
["B","Heating + Air Con","Panasonic ","WET UFH","YES","28 °C","Room Temp","Room Thimble Sensor"]
["B","Heating + Air Con","Panasonic ","WET UFH","YES","28 °C","Room Temp","AC Unit"]
["B","Heating + Air Con","Panasonic ","WET UFH","YES","28 °C","Room Temp","Wired Controller"]
["B","Heating + Air Con","Panasonic ","WET UFH","YES","29 °C","Room Temp","Room Thimble Sensor"]
["B","Heating + Air Con","Panasonic ","WET UFH","YES","29 °C","Room Temp","AC Unit"]
["B","Heating + Air Con","Panasonic ","WET UFH","YES","29 °C","Room Temp","Wired Controller"]
["B","Heating + Air Con","Panasonic ","WET UFH","YES","30 °C","Room Temp","Room Thimble Sensor"]
["B","Heating + Air Con","Panasonic ","WET UFH","YES","30 °C","Room Temp","AC Unit"]
["B","Heating + Air Con","Panasonic ","WET UFH","YES","30 °C","Room Temp","Wired Controller"]
["B","Heating + Air Con","Panasonic ","WET UFH","YES","31 °C","Room Temp","Room Thimble Sensor"]
["B","Heating + Air Con","Panasonic ","WET UFH","YES","31 °C","Room Temp","AC Unit"]
["B","Heating + Air Con","Panasonic ","WET UFH","YES","31 °C","Room Temp","Wired Controller"]
["B","Heating + Air Con","Panasonic ","WET UFH","YES","32 °C","Room Temp","Room Thimble Sensor"]
["B","Heating + Air Con","Panasonic ","WET UFH","YES","32 °C","Room Temp","AC Unit"]
["B","Heating + Air Con","Panasonic ","WET UFH","YES","32 °C","Room Temp","Wired Controller"]
["B","Heating + Air Con","Panasonic ","WET UFH","YES","33 °C","Room Temp","Room Thimble Sensor"]
["B","Heating + Air Con","Panasonic ","WET UFH","YES","33 °C","Room Temp","AC Unit"]
["B","Heating + Air Con","Panasonic ","WET UFH","YES","33 °C","Room Temp","Wired Controller"]
["B","Heating + Air Con","Panasonic ","WET UFH","YES","34 °C","Room Temp","Room Thimble Sensor"]
["B","Heating + Air Con","Panasonic ","WET UFH","YES","34 °C","Room Temp","AC Unit"]
["B","Heating + Air Con","Panasonic ","WET UFH","YES","34 °C","Room Temp","Wired Controller"]
["B","Heating + Air Con","Panasonic ","WET UFH","YES","35 °C","Room Temp","Room Thimble Sensor"]
["B","Heating + Air Con","Panasonic ","WET UFH","YES","35 °C","Room Temp","AC Unit"]
["B","Heating + Air Con","Panasonic ","WET UFH","YES","35 °C","Room Temp","Wired Controller"]
["B","Heating + Air Con","Panasonic ","WET UFH","YES","36 °C","Room Temp","Room Thimble Sensor"]
["B","Heating + Air Con","Panasonic ","WET UFH","YES","36 °C","Room Temp","AC Unit"]
["B","Heating + Air Con","Panasonic ","WET UFH","YES","36 °C","Room Temp","Wired Controller"]
["B","Heating + Air Con","Panasonic ","WET UFH","YES","37 °C","Room Temp","Room Thimble Sensor"]
["B","Heating + Air Con","Panasonic ","WET UFH","YES","37 °C","Room Temp","AC Unit"]
["B","Heating + Air Con","Panasonic ","WET UFH","YES","37 °C","Room Temp","Wired Controller"]
["B","Heating + Air Con","Panasonic ","WET UFH","YES","38 °C","Room Temp","Room Thimble Sensor"]
["B","Heating + Air Con","Panasonic ","WET UFH","YES","38 °C","Room Temp","AC Unit"]
["B","Heating + Air Con","Panasonic ","WET UFH","YES","38 °C","Room Temp","Wired Controller"]
["B","Heating + Air Con","Panasonic ","WET UFH","YES","39 °C","Room Temp","Room Thimble Sensor"]
["B","Heating + Air Con","Panasonic ","WET UFH","YES","39 °C","Room Temp","AC Unit"]
["B","Heating + Air Con","Panasonic ","WET UFH","YES","39 °C","Room Temp","Wired Controller"]
["B","Heating + Air Con","Panasonic ","WET UFH","YES","40 °C","Room Temp","Room Thimble Sensor"]
["B","Heating + Air Con","Panasonic ","WET UFH","YES","40 °C","Room Temp","AC Unit"]
["B","Heating + Air Con","Panasonic ","WET UFH","YES","40 °C","Room Temp","Wired Controller"]
["C","Heating + Air Con","Panasonic ","ELECTRIC UFH","NO","N/A","Room Temp","Room Thimble Sensor"]
["C","Heating + Air Con","Panasonic ","ELECTRIC UFH","NO","N/A","Room Temp","AC Unit"]
["C","Heating + Air Con","Panasonic ","ELECTRIC UFH","NO","N/A","Room Temp","Wired Controller"]
["D","Heating + Air Con","Panasonic ","ELECTRIC UFH","YES","TBA","Room Temp","Room Thimble Sensor"]
["D","Heating + Air Con","Panasonic ","ELECTRIC UFH","YES","TBA","Room Temp","AC Unit"]
["D","Heating + Air Con","Panasonic ","ELECTRIC UFH","YES","TBA","Room Temp","Wired Controller"]
["D","Heating + Air Con","Panasonic ","ELECTRIC UFH","YES","25 °C","Room Temp","Room Thimble Sensor"]
["D","Heating + Air Con","Panasonic ","ELECTRIC UFH","YES","25 °C","Room Temp","AC Unit"]
["D","Heating + Air Con","Panasonic ","ELECTRIC UFH","YES","25 °C","Room Temp","Wired Controller"]
["D","Heating + Air Con","Panasonic ","ELECTRIC UFH","YES","26 °C","Room Temp","Room Thimble Sensor"]
["D","Heating + Air Con","Panasonic ","ELECTRIC UFH","YES","26 °C","Room Temp","AC Unit"]
["D","Heating + Air Con","Panasonic ","ELECTRIC UFH","YES","26 °C","Room Temp","Wired Controller"]
["D","Heating + Air Con","Panasonic ","ELECTRIC UFH","YES","27 °C","Room Temp","Room Thimble Sensor"]
["D","Heating + Air Con","Panasonic ","ELECTRIC UFH","YES","27 °C","Room Temp","AC Unit"]
["D","Heating + Air Con","Panasonic ","ELECTRIC UFH","YES","27 °C","Room Temp","Wired Controller"]
["D","Heating + Air Con","Panasonic ","ELECTRIC UFH","YES","28 °C","Room Temp","Room Thimble Sensor"]
["D","Heating + Air Con","Panasonic ","ELECTRIC UFH","YES","28 °C","Room Temp","AC Unit"]
["D","Heating + Air Con","Panasonic ","ELECTRIC UFH","YES","28 °C","Room Temp","Wired Controller"]
["D","Heating + Air Con","Panasonic ","ELECTRIC UFH","YES","29 °C","Room Temp","Room Thimble Sensor"]
["D","Heating + Air Con","Panasonic ","ELECTRIC UFH","YES","29 °C","Room Temp","AC Unit"]
["D","Heating + Air Con","Panasonic ","ELECTRIC UFH","YES","29 °C","Room Temp","Wired Controller"]
["D","Heating + Air Con","Panasonic ","ELECTRIC UFH","YES","30 °C","Room Temp","Room Thimble Sensor"]
["D","Heating + Air Con","Panasonic ","ELECTRIC UFH","YES","30 °C","Room Temp","AC Unit"]
["D","Heating + Air Con","Panasonic ","ELECTRIC UFH","YES","30 °C","Room Temp","Wired Controller"]
["D","Heating + Air Con","Panasonic ","ELECTRIC UFH","YES","31 °C","Room Temp","Room Thimble Sensor"]
["D","Heating + Air Con","Panasonic ","ELECTRIC UFH","YES","31 °C","Room Temp","AC Unit"]
["D","Heating + Air Con","Panasonic ","ELECTRIC UFH","YES","31 °C","Room Temp","Wired Controller"]
["D","Heating + Air Con","Panasonic ","ELECTRIC UFH","YES","32 °C","Room Temp","Room Thimble Sensor"]
["D","Heating + Air Con","Panasonic ","ELECTRIC UFH","YES","32 °C","Room Temp","AC Unit"]
["D","Heating + Air Con","Panasonic ","ELECTRIC UFH","YES","32 °C","Room Temp","Wired Controller"]
["D","Heating + Air Con","Panasonic ","ELECTRIC UFH","YES","33 °C","Room Temp","Room Thimble Sensor"]
["D","Heating + Air Con","Panasonic ","ELECTRIC UFH","YES","33 °C","Room Temp","AC Unit"]
["D","Heating + Air Con","Panasonic ","ELECTRIC UFH","YES","33 °C","Room Temp","Wired Controller"]
["D","Heating + Air Con","Panasonic ","ELECTRIC UFH","YES","34 °C","Room Temp","Room Thimble Sensor"]
["D","Heating + Air Con","Panasonic ","ELECTRIC UFH","YES","34 °C","Room Temp","AC Unit"]
["D","Heating + Air Con","Panasonic ","ELECTRIC UFH","YES","34 °C","Room Temp","Wired Controller"]
["D","Heating + Air Con","Panasonic ","ELECTRIC UFH","YES","35 °C","Room Temp","Room Thimble Sensor"]
["D","Heating + Air Con","Panasonic ","ELECTRIC UFH","YES","35 °C","Room Temp","AC Unit"]
["D","Heating + Air Con","Panasonic ","ELECTRIC UFH","YES","35 °C","Room Temp","Wired Controller"]
["D","Heating + Air Con","Panasonic ","ELECTRIC UFH","YES","36 °C","Room Temp","Room Thimble Sensor"]
["D","Heating + Air Con","Panasonic ","ELECTRIC UFH","YES","36 °C","Room Temp","AC Unit"]
["D","Heating + Air Con","Panasonic ","ELECTRIC UFH","YES","36 °C","Room Temp","Wired Controller"]
["D","Heating + Air Con","Panasonic ","ELECTRIC UFH","YES","37 °C","Room Temp","Room Thimble Sensor"]
["D","Heating + Air Con","Panasonic ","ELECTRIC UFH","YES","37 °C","Room Temp","AC Unit"]
["D","Heating + Air Con","Panasonic ","ELECTRIC UFH","YES","37 °C","Room Temp","Wired Controller"]
["D","Heating + Air Con","Panasonic ","ELECTRIC UFH","YES","38 °C","Room Temp","Room Thimble Sensor"]
["D","Heating + Air Con","Panasonic ","ELECTRIC UFH","YES","38 °C","Room Temp","AC Unit"]
["D","Heating + Air Con","Panasonic ","ELECTRIC UFH","YES","38 °C","Room Temp","Wired Controller"]
["D","Heating + Air Con","Panasonic ","ELECTRIC UFH","YES","39 °C","Room Temp","Room Thimble Sensor"]
["D","Heating + Air Con","Panasonic ","ELECTRIC UFH","YES","39 °C","Room Temp","AC Unit"]
["D","Heating + Air Con","Panasonic ","ELECTRIC UFH","YES","39 °C","Room Temp","Wired Controller"]
["D","Heating + Air Con","Panasonic ","ELECTRIC UFH","YES","40 °C","Room Temp","Room Thimble Sensor"]
["D","Heating + Air Con","Panasonic ","ELECTRIC UFH","YES","40 °C","Room Temp","AC Unit"]
["D","Heating + Air Con","Panasonic ","ELECTRIC UFH","YES","40 °C","Room Temp","Wired Controller"]
["E","Heating + Air Con","Panasonic ","RADIATOR","N/A","N/A","Room Temp","Room Thimble Sensor"]
["E","Heating + Air Con","Panasonic ","RADIATOR","N/A","N/A","Room Temp","AC Unit"]
["E","Heating + Air Con","Panasonic ","RADIATOR","N/A","N/A","Room Temp","Wired Controller"]
["A","Heating + Air Con","Fujitsu ","WET UFH","NO","N/A","Room Temp","Room Thimble Sensor"]
["A","Heating + Air Con","Fujitsu ","WET UFH","NO","N/A","Room Temp","AC Unit"]
["A","Heating + Air Con","Fujitsu ","WET UFH","NO","N/A","Room Temp","Wired Controller"]
["B","Heating + Air Con","Fujitsu ","WET UFH","YES","TBA","Room Temp","Room Thimble Sensor"]
["B","Heating + Air Con","Fujitsu ","WET UFH","YES","TBA","Room Temp","AC Unit"]
["B","Heating + Air Con","Fujitsu ","WET UFH","YES","TBA","Room Temp","Wired Controller"]
["B","Heating + Air Con","Fujitsu ","WET UFH","YES","25 °C","Room Temp","Room Thimble Sensor"]
["B","Heating + Air Con","Fujitsu ","WET UFH","YES","25 °C","Room Temp","AC Unit"]
["B","Heating + Air Con","Fujitsu ","WET UFH","YES","25 °C","Room Temp","Wired Controller"]
["B","Heating + Air Con","Fujitsu ","WET UFH","YES","26 °C","Room Temp","Room Thimble Sensor"]
["B","Heating + Air Con","Fujitsu ","WET UFH","YES","26 °C","Room Temp","AC Unit"]
["B","Heating + Air Con","Fujitsu ","WET UFH","YES","26 °C","Room Temp","Wired Controller"]
["B","Heating + Air Con","Fujitsu ","WET UFH","YES","27 °C","Room Temp","Room Thimble Sensor"]
["B","Heating + Air Con","Fujitsu ","WET UFH","YES","27 °C","Room Temp","AC Unit"]
["B","Heating + Air Con","Fujitsu ","WET UFH","YES","27 °C","Room Temp","Wired Controller"]
["B","Heating + Air Con","Fujitsu ","WET UFH","YES","28 °C","Room Temp","Room Thimble Sensor"]
["B","Heating + Air Con","Fujitsu ","WET UFH","YES","28 °C","Room Temp","AC Unit"]
["B","Heating + Air Con","Fujitsu ","WET UFH","YES","28 °C","Room Temp","Wired Controller"]
["B","Heating + Air Con","Fujitsu ","WET UFH","YES","29 °C","Room Temp","Room Thimble Sensor"]
["B","Heating + Air Con","Fujitsu ","WET UFH","YES","29 °C","Room Temp","AC Unit"]
["B","Heating + Air Con","Fujitsu ","WET UFH","YES","29 °C","Room Temp","Wired Controller"]
["B","Heating + Air Con","Fujitsu ","WET UFH","YES","30 °C","Room Temp","Room Thimble Sensor"]
["B","Heating + Air Con","Fujitsu ","WET UFH","YES","30 °C","Room Temp","AC Unit"]
["B","Heating + Air Con","Fujitsu ","WET UFH","YES","30 °C","Room Temp","Wired Controller"]
["B","Heating + Air Con","Fujitsu ","WET UFH","YES","31 °C","Room Temp","Room Thimble Sensor"]
["B","Heating + Air Con","Fujitsu ","WET UFH","YES","31 °C","Room Temp","AC Unit"]
["B","Heating + Air Con","Fujitsu ","WET UFH","YES","31 °C","Room Temp","Wired Controller"]
["B","Heating + Air Con","Fujitsu ","WET UFH","YES","32 °C","Room Temp","Room Thimble Sensor"]
["B","Heating + Air Con","Fujitsu ","WET UFH","YES","32 °C","Room Temp","AC Unit"]
["B","Heating + Air Con","Fujitsu ","WET UFH","YES","32 °C","Room Temp","Wired Controller"]
["B","Heating + Air Con","Fujitsu ","WET UFH","YES","33 °C","Room Temp","Room Thimble Sensor"]
["B","Heating + Air Con","Fujitsu ","WET UFH","YES","33 °C","Room Temp","AC Unit"]
["B","Heating + Air Con","Fujitsu ","WET UFH","YES","33 °C","Room Temp","Wired Controller"]
["B","Heating + Air Con","Fujitsu ","WET UFH","YES","34 °C","Room Temp","Room Thimble Sensor"]
["B","Heating + Air Con","Fujitsu ","WET UFH","YES","34 °C","Room Temp","AC Unit"]
["B","Heating + Air Con","Fujitsu ","WET UFH","YES","34 °C","Room Temp","Wired Controller"]
["B","Heating + Air Con","Fujitsu ","WET UFH","YES","35 °C","Room Temp","Room Thimble Sensor"]
["B","Heating + Air Con","Fujitsu ","WET UFH","YES","35 °C","Room Temp","AC Unit"]
["B","Heating + Air Con","Fujitsu ","WET UFH","YES","35 °C","Room Temp","Wired Controller"]
["B","Heating + Air Con","Fujitsu ","WET UFH","YES","36 °C","Room Temp","Room Thimble Sensor"]
["B","Heating + Air Con","Fujitsu ","WET UFH","YES","36 °C","Room Temp","AC Unit"]
["B","Heating + Air Con","Fujitsu ","WET UFH","YES","36 °C","Room Temp","Wired Controller"]
["B","Heating + Air Con","Fujitsu ","WET UFH","YES","37 °C","Room Temp","Room Thimble Sensor"]
["B","Heating + Air Con","Fujitsu ","WET UFH","YES","37 °C","Room Temp","AC Unit"]
["B","Heating + Air Con","Fujitsu ","WET UFH","YES","37 °C","Room Temp","Wired Controller"]
["B","Heating + Air Con","Fujitsu ","WET UFH","YES","38 °C","Room Temp","Room Thimble Sensor"]
["B","Heating + Air Con","Fujitsu ","WET UFH","YES","38 °C","Room Temp","AC Unit"]
["B","Heating + Air Con","Fujitsu ","WET UFH","YES","38 °C","Room Temp","Wired Controller"]
["B","Heating + Air Con","Fujitsu ","WET UFH","YES","39 °C","Room Temp","Room Thimble Sensor"]
["B","Heating + Air Con","Fujitsu ","WET UFH","YES","39 °C","Room Temp","AC Unit"]
["B","Heating + Air Con","Fujitsu ","WET UFH","YES","39 °C","Room Temp","Wired Controller"]
["B","Heating + Air Con","Fujitsu ","WET UFH","YES","40 °C","Room Temp","Room Thimble Sensor"]
["B","Heating + Air Con","Fujitsu ","WET UFH","YES","40 °C","Room Temp","AC Unit"]
["B","Heating + Air Con","Fujitsu ","WET UFH","YES","40 °C","Room Temp","Wired Controller"]
["C","Heating + Air Con","Fujitsu ","ELECTRIC UFH","NO","N/A","Room Temp","Room Thimble Sensor"]
["C","Heating + Air Con","Fujitsu ","ELECTRIC UFH","NO","N/A","Room Temp","AC Unit"]
["C","Heating + Air Con","Fujitsu ","ELECTRIC UFH","NO","N/A","Room Temp","Wired Controller"]
["D","Heating + Air Con","Fujitsu ","ELECTRIC UFH","YES","TBA","Room Temp","Room Thimble Sensor"]
["D","Heating + Air Con","Fujitsu ","ELECTRIC UFH","YES","TBA","Room Temp","AC Unit"]
["D","Heating + Air Con","Fujitsu ","ELECTRIC UFH","YES","TBA","Room Temp","Wired Controller"]
["D","Heating + Air Con","Fujitsu ","ELECTRIC UFH","YES","25 °C","Room Temp","Room Thimble Sensor"]
["D","Heating + Air Con","Fujitsu ","ELECTRIC UFH","YES","25 °C","Room Temp","AC Unit"]
["D","Heating + Air Con","Fujitsu ","ELECTRIC UFH","YES","25 °C","Room Temp","Wired Controller"]
["D","Heating + Air Con","Fujitsu ","ELECTRIC UFH","YES","26 °C","Room Temp","Room Thimble Sensor"]
["D","Heating + Air Con","Fujitsu ","ELECTRIC UFH","YES","26 °C","Room Temp","AC Unit"]
["D","Heating + Air Con","Fujitsu ","ELECTRIC UFH","YES","26 °C","Room Temp","Wired Controller"]
["D","Heating + Air Con","Fujitsu ","ELECTRIC UFH","YES","27 °C","Room Temp","Room Thimble Sensor"]
["D","Heating + Air Con","Fujitsu ","ELECTRIC UFH","YES","27 °C","Room Temp","AC Unit"]
["D","Heating + Air Con","Fujitsu ","ELECTRIC UFH","YES","27 °C","Room Temp","Wired Controller"]
["D","Heating + Air Con","Fujitsu ","ELECTRIC UFH","YES","28 °C","Room Temp","Room Thimble Sensor"]
["D","Heating + Air Con","Fujitsu ","ELECTRIC UFH","YES","28 °C","Room Temp","AC Unit"]
["D","Heating + Air Con","Fujitsu ","ELECTRIC UFH","YES","28 °C","Room Temp","Wired Controller"]
["D","Heating + Air Con","Fujitsu ","ELECTRIC UFH","YES","29 °C","Room Temp","Room Thimble Sensor"]
["D","Heating + Air Con","Fujitsu ","ELECTRIC UFH","YES","29 °C","Room Temp","AC Unit"]
["D","Heating + Air Con","Fujitsu ","ELECTRIC UFH","YES","29 °C","Room Temp","Wired Controller"]
["D","Heating + Air Con","Fujitsu ","ELECTRIC UFH","YES","30 °C","Room Temp","Room Thimble Sensor"]
["D","Heating + Air Con","Fujitsu ","ELECTRIC UFH","YES","30 °C","Room Temp","AC Unit"]
["D","Heating + Air Con","Fujitsu ","ELECTRIC UFH","YES","30 °C","Room Temp","Wired Controller"]
["D","Heating + Air Con","Fujitsu ","ELECTRIC UFH","YES","31 °C","Room Temp","Room Thimble Sensor"]
["D","Heating + Air Con","Fujitsu ","ELECTRIC UFH","YES","31 °C","Room Temp","AC Unit"]
["D","Heating + Air Con","Fujitsu ","ELECTRIC UFH","YES","31 °C","Room Temp","Wired Controller"]
["D","Heating + Air Con","Fujitsu ","ELECTRIC UFH","YES","32 °C","Room Temp","Room Thimble Sensor"]
["D","Heating + Air Con","Fujitsu ","ELECTRIC UFH","YES","32 °C","Room Temp","AC Unit"]
["D","Heating + Air Con","Fujitsu ","ELECTRIC UFH","YES","32 °C","Room Temp","Wired Controller"]
["D","Heating + Air Con","Fujitsu ","ELECTRIC UFH","YES","33 °C","Room Temp","Room Thimble Sensor"]
["D","Heating + Air Con","Fujitsu ","ELECTRIC UFH","YES","33 °C","Room Temp","AC Unit"]
["D","Heating + Air Con","Fujitsu ","ELECTRIC UFH","YES","33 °C","Room Temp","Wired Controller"]
["D","Heating + Air Con","Fujitsu ","ELECTRIC UFH","YES","34 °C","Room Temp","Room Thimble Sensor"]
["D","Heating + Air Con","Fujitsu ","ELECTRIC UFH","YES","34 °C","Room Temp","AC Unit"]
["D","Heating + Air Con","Fujitsu ","ELECTRIC UFH","YES","34 °C","Room Temp","Wired Controller"]
["D","Heating + Air Con","Fujitsu ","ELECTRIC UFH","YES","35 °C","Room Temp","Room Thimble Sensor"]
["D","Heating + Air Con","Fujitsu ","ELECTRIC UFH","YES","35 °C","Room Temp","AC Unit"]
["D","Heating + Air Con","Fujitsu ","ELECTRIC UFH","YES","35 °C","Room Temp","Wired Controller"]
["D","Heating + Air Con","Fujitsu ","ELECTRIC UFH","YES","36 °C","Room Temp","Room Thimble Sensor"]
["D","Heating + Air Con","Fujitsu ","ELECTRIC UFH","YES","36 °C","Room Temp","AC Unit"]
["D","Heating + Air Con","Fujitsu ","ELECTRIC UFH","YES","36 °C","Room Temp","Wired Controller"]
["D","Heating + Air Con","Fujitsu ","ELECTRIC UFH","YES","37 °C","Room Temp","Room Thimble Sensor"]
["D","Heating + Air Con","Fujitsu ","ELECTRIC UFH","YES","37 °C","Room Temp","AC Unit"]
["D","Heating + Air Con","Fujitsu ","ELECTRIC UFH","YES","37 °C","Room Temp","Wired Controller"]
["D","Heating + Air Con","Fujitsu ","ELECTRIC UFH","YES","38 °C","Room Temp","Room Thimble Sensor"]
["D","Heating + Air Con","Fujitsu ","ELECTRIC UFH","YES","38 °C","Room Temp","AC Unit"]
["D","Heating + Air Con","Fujitsu ","ELECTRIC UFH","YES","38 °C","Room Temp","Wired Controller"]
["D","Heating + Air Con","Fujitsu ","ELECTRIC UFH","YES","39 °C","Room Temp","Room Thimble Sensor"]
["D","Heating + Air Con","Fujitsu ","ELECTRIC UFH","YES","39 °C","Room Temp","AC Unit"]
["D","Heating + Air Con","Fujitsu ","ELECTRIC UFH","YES","39 °C","Room Temp","Wired Controller"]
["D","Heating + Air Con","Fujitsu ","ELECTRIC UFH","YES","40 °C","Room Temp","Room Thimble Sensor"]
["D","Heating + Air Con","Fujitsu ","ELECTRIC UFH","YES","40 °C","Room Temp","AC Unit"]
["D","Heating + Air Con","Fujitsu ","ELECTRIC UFH","YES","40 °C","Room Temp","Wired Controller"]
["E","Heating + Air Con","Fujitsu ","RADIATOR","N/A","N/A","Room Temp","Room Thimble Sensor"]
["E","Heating + Air Con","Fujitsu ","RADIATOR","N/A","N/A","Room Temp","AC Unit"]
["E","Heating + Air Con","Fujitsu ","RADIATOR","N/A","N/A","Room Temp","Wired Controller"]
["A","Heating + Air Con","Hitachi ","WET UFH","NO","N/A","Room Temp","Room Thimble Sensor"]
["A","Heating + Air Con","Hitachi ","WET UFH","NO","N/A","Room Temp","AC Unit"]
["A","Heating + Air Con","Hitachi ","WET UFH","NO","N/A","Room Temp","Wired Controller"]
["B","Heating + Air Con","Hitachi ","WET UFH","YES","TBA","Room Temp","Room Thimble Sensor"]
["B","Heating + Air Con","Hitachi ","WET UFH","YES","TBA","Room Temp","AC Unit"]
["B","Heating + Air Con","Hitachi ","WET UFH","YES","TBA","Room Temp","Wired Controller"]
["B","Heating + Air Con","Hitachi ","WET UFH","YES","25 °C","Room Temp","Room Thimble Sensor"]
["B","Heating + Air Con","Hitachi ","WET UFH","YES","25 °C","Room Temp","AC Unit"]
["B","Heating + Air Con","Hitachi ","WET UFH","YES","25 °C","Room Temp","Wired Controller"]
["B","Heating + Air Con","Hitachi ","WET UFH","YES","26 °C","Room Temp","Room Thimble Sensor"]
["B","Heating + Air Con","Hitachi ","WET UFH","YES","26 °C","Room Temp","AC Unit"]
["B","Heating + Air Con","Hitachi ","WET UFH","YES","26 °C","Room Temp","Wired Controller"]
["B","Heating + Air Con","Hitachi ","WET UFH","YES","27 °C","Room Temp","Room Thimble Sensor"]
["B","Heating + Air Con","Hitachi ","WET UFH","YES","27 °C","Room Temp","AC Unit"]
["B","Heating + Air Con","Hitachi ","WET UFH","YES","27 °C","Room Temp","Wired Controller"]
["B","Heating + Air Con","Hitachi ","WET UFH","YES","28 °C","Room Temp","Room Thimble Sensor"]
["B","Heating + Air Con","Hitachi ","WET UFH","YES","28 °C","Room Temp","AC Unit"]
["B","Heating + Air Con","Hitachi ","WET UFH","YES","28 °C","Room Temp","Wired Controller"]
["B","Heating + Air Con","Hitachi ","WET UFH","YES","29 °C","Room Temp","Room Thimble Sensor"]
["B","Heating + Air Con","Hitachi ","WET UFH","YES","29 °C","Room Temp","AC Unit"]
["B","Heating + Air Con","Hitachi ","WET UFH","YES","29 °C","Room Temp","Wired Controller"]
["B","Heating + Air Con","Hitachi ","WET UFH","YES","30 °C","Room Temp","Room Thimble Sensor"]
["B","Heating + Air Con","Hitachi ","WET UFH","YES","30 °C","Room Temp","AC Unit"]
["B","Heating + Air Con","Hitachi ","WET UFH","YES","30 °C","Room Temp","Wired Controller"]
["B","Heating + Air Con","Hitachi ","WET UFH","YES","31 °C","Room Temp","Room Thimble Sensor"]
["B","Heating + Air Con","Hitachi ","WET UFH","YES","31 °C","Room Temp","AC Unit"]
["B","Heating + Air Con","Hitachi ","WET UFH","YES","31 °C","Room Temp","Wired Controller"]
["B","Heating + Air Con","Hitachi ","WET UFH","YES","32 °C","Room Temp","Room Thimble Sensor"]
["B","Heating + Air Con","Hitachi ","WET UFH","YES","32 °C","Room Temp","AC Unit"]
["B","Heating + Air Con","Hitachi ","WET UFH","YES","32 °C","Room Temp","Wired Controller"]
["B","Heating + Air Con","Hitachi ","WET UFH","YES","33 °C","Room Temp","Room Thimble Sensor"]
["B","Heating + Air Con","Hitachi ","WET UFH","YES","33 °C","Room Temp","AC Unit"]
["B","Heating + Air Con","Hitachi ","WET UFH","YES","33 °C","Room Temp","Wired Controller"]
["B","Heating + Air Con","Hitachi ","WET UFH","YES","34 °C","Room Temp","Room Thimble Sensor"]
["B","Heating + Air Con","Hitachi ","WET UFH","YES","34 °C","Room Temp","AC Unit"]
["B","Heating + Air Con","Hitachi ","WET UFH","YES","34 °C","Room Temp","Wired Controller"]
["B","Heating + Air Con","Hitachi ","WET UFH","YES","35 °C","Room Temp","Room Thimble Sensor"]
["B","Heating + Air Con","Hitachi ","WET UFH","YES","35 °C","Room Temp","AC Unit"]
["B","Heating + Air Con","Hitachi ","WET UFH","YES","35 °C","Room Temp","Wired Controller"]
["B","Heating + Air Con","Hitachi ","WET UFH","YES","36 °C","Room Temp","Room Thimble Sensor"]
["B","Heating + Air Con","Hitachi ","WET UFH","YES","36 °C","Room Temp","AC Unit"]
["B","Heating + Air Con","Hitachi ","WET UFH","YES","36 °C","Room Temp","Wired Controller"]
["B","Heating + Air Con","Hitachi ","WET UFH","YES","37 °C","Room Temp","Room Thimble Sensor"]
["B","Heating + Air Con","Hitachi ","WET UFH","YES","37 °C","Room Temp","AC Unit"]
["B","Heating + Air Con","Hitachi ","WET UFH","YES","37 °C","Room Temp","Wired Controller"]
["B","Heating + Air Con","Hitachi ","WET UFH","YES","38 °C","Room Temp","Room Thimble Sensor"]
["B","Heating + Air Con","Hitachi ","WET UFH","YES","38 °C","Room Temp","AC Unit"]
["B","Heating + Air Con","Hitachi ","WET UFH","YES","38 °C","Room Temp","Wired Controller"]
["B","Heating + Air Con","Hitachi ","WET UFH","YES","39 °C","Room Temp","Room Thimble Sensor"]
["B","Heating + Air Con","Hitachi ","WET UFH","YES","39 °C","Room Temp","AC Unit"]
["B","Heating + Air Con","Hitachi ","WET UFH","YES","39 °C","Room Temp","Wired Controller"]
["B","Heating + Air Con","Hitachi ","WET UFH","YES","40 °C","Room Temp","Room Thimble Sensor"]
["B","Heating + Air Con","Hitachi ","WET UFH","YES","40 °C","Room Temp","AC Unit"]
["B","Heating + Air Con","Hitachi ","WET UFH","YES","40 °C","Room Temp","Wired Controller"]
["C","Heating + Air Con","Hitachi ","ELECTRIC UFH","NO","N/A","Room Temp","Room Thimble Sensor"]
["C","Heating + Air Con","Hitachi ","ELECTRIC UFH","NO","N/A","Room Temp","AC Unit"]
["C","Heating + Air Con","Hitachi ","ELECTRIC UFH","NO","N/A","Room Temp","Wired Controller"]
["D","Heating + Air Con","Hitachi ","ELECTRIC UFH","YES","TBA","Room Temp","Room Thimble Sensor"]
["D","Heating + Air Con","Hitachi ","ELECTRIC UFH","YES","TBA","Room Temp","AC Unit"]
["D","Heating + Air Con","Hitachi ","ELECTRIC UFH","YES","TBA","Room Temp","Wired Controller"]
["D","Heating + Air Con","Hitachi ","ELECTRIC UFH","YES","25 °C","Room Temp","Room Thimble Sensor"]
["D","Heating + Air Con","Hitachi ","ELECTRIC UFH","YES","25 °C","Room Temp","AC Unit"]
["D","Heating + Air Con","Hitachi ","ELECTRIC UFH","YES","25 °C","Room Temp","Wired Controller"]
["D","Heating + Air Con","Hitachi ","ELECTRIC UFH","YES","26 °C","Room Temp","Room Thimble Sensor"]
["D","Heating + Air Con","Hitachi ","ELECTRIC UFH","YES","26 °C","Room Temp","AC Unit"]
["D","Heating + Air Con","Hitachi ","ELECTRIC UFH","YES","26 °C","Room Temp","Wired Controller"]
["D","Heating + Air Con","Hitachi ","ELECTRIC UFH","YES","27 °C","Room Temp","Room Thimble Sensor"]
["D","Heating + Air Con","Hitachi ","ELECTRIC UFH","YES","27 °C","Room Temp","AC Unit"]
["D","Heating + Air Con","Hitachi ","ELECTRIC UFH","YES","27 °C","Room Temp","Wired Controller"]
["D","Heating + Air Con","Hitachi ","ELECTRIC UFH","YES","28 °C","Room Temp","Room Thimble Sensor"]
["D","Heating + Air Con","Hitachi ","ELECTRIC UFH","YES","28 °C","Room Temp","AC Unit"]
["D","Heating + Air Con","Hitachi ","ELECTRIC UFH","YES","28 °C","Room Temp","Wired Controller"]
["D","Heating + Air Con","Hitachi ","ELECTRIC UFH","YES","29 °C","Room Temp","Room Thimble Sensor"]
["D","Heating + Air Con","Hitachi ","ELECTRIC UFH","YES","29 °C","Room Temp","AC Unit"]
["D","Heating + Air Con","Hitachi ","ELECTRIC UFH","YES","29 °C","Room Temp","Wired Controller"]
["D","Heating + Air Con","Hitachi ","ELECTRIC UFH","YES","30 °C","Room Temp","Room Thimble Sensor"]
["D","Heating + Air Con","Hitachi ","ELECTRIC UFH","YES","30 °C","Room Temp","AC Unit"]
["D","Heating + Air Con","Hitachi ","ELECTRIC UFH","YES","30 °C","Room Temp","Wired Controller"]
["D","Heating + Air Con","Hitachi ","ELECTRIC UFH","YES","31 °C","Room Temp","Room Thimble Sensor"]
["D","Heating + Air Con","Hitachi ","ELECTRIC UFH","YES","31 °C","Room Temp","AC Unit"]
["D","Heating + Air Con","Hitachi ","ELECTRIC UFH","YES","31 °C","Room Temp","Wired Controller"]
["D","Heating + Air Con","Hitachi ","ELECTRIC UFH","YES","32 °C","Room Temp","Room Thimble Sensor"]
["D","Heating + Air Con","Hitachi ","ELECTRIC UFH","YES","32 °C","Room Temp","AC Unit"]
["D","Heating + Air Con","Hitachi ","ELECTRIC UFH","YES","32 °C","Room Temp","Wired Controller"]
["D","Heating + Air Con","Hitachi ","ELECTRIC UFH","YES","33 °C","Room Temp","Room Thimble Sensor"]
["D","Heating + Air Con","Hitachi ","ELECTRIC UFH","YES","33 °C","Room Temp","AC Unit"]
["D","Heating + Air Con","Hitachi ","ELECTRIC UFH","YES","33 °C","Room Temp","Wired Controller"]
["D","Heating + Air Con","Hitachi ","ELECTRIC UFH","YES","34 °C","Room Temp","Room Thimble Sensor"]
["D","Heating + Air Con","Hitachi ","ELECTRIC UFH","YES","34 °C","Room Temp","AC Unit"]
["D","Heating + Air Con","Hitachi ","ELECTRIC UFH","YES","34 °C","Room Temp","Wired Controller"]
["D","Heating + Air Con","Hitachi ","ELECTRIC UFH","YES","35 °C","Room Temp","Room Thimble Sensor"]
["D","Heating + Air Con","Hitachi ","ELECTRIC UFH","YES","35 °C","Room Temp","AC Unit"]
["D","Heating + Air Con","Hitachi ","ELECTRIC UFH","YES","35 °C","Room Temp","Wired Controller"]
["D","Heating + Air Con","Hitachi ","ELECTRIC UFH","YES","36 °C","Room Temp","Room Thimble Sensor"]
["D","Heating + Air Con","Hitachi ","ELECTRIC UFH","YES","36 °C","Room Temp","AC Unit"]
["D","Heating + Air Con","Hitachi ","ELECTRIC UFH","YES","36 °C","Room Temp","Wired Controller"]
["D","Heating + Air Con","Hitachi ","ELECTRIC UFH","YES","37 °C","Room Temp","Room Thimble Sensor"]
["D","Heating + Air Con","Hitachi ","ELECTRIC UFH","YES","37 °C","Room Temp","AC Unit"]
["D","Heating + Air Con","Hitachi ","ELECTRIC UFH","YES","37 °C","Room Temp","Wired Controller"]
["D","Heating + Air Con","Hitachi ","ELECTRIC UFH","YES","38 °C","Room Temp","Room Thimble Sensor"]
["D","Heating + Air Con","Hitachi ","ELECTRIC UFH","YES","38 °C","Room Temp","AC Unit"]
["D","Heating + Air Con","Hitachi ","ELECTRIC UFH","YES","38 °C","Room Temp","Wired Controller"]
["D","Heating + Air Con","Hitachi ","ELECTRIC UFH","YES","39 °C","Room Temp","Room Thimble Sensor"]
["D","Heating + Air Con","Hitachi ","ELECTRIC UFH","YES","39 °C","Room Temp","AC Unit"]
["D","Heating + Air Con","Hitachi ","ELECTRIC UFH","YES","39 °C","Room Temp","Wired Controller"]
["D","Heating + Air Con","Hitachi ","ELECTRIC UFH","YES","40 °C","Room Temp","Room Thimble Sensor"]
["D","Heating + Air Con","Hitachi ","ELECTRIC UFH","YES","40 °C","Room Temp","AC Unit"]
["D","Heating + Air Con","Hitachi ","ELECTRIC UFH","YES","40 °C","Room Temp","Wired Controller"]
["E","Heating + Air Con","Hitachi ","RADIATOR","N/A","N/A","Room Temp","Room Thimble Sensor"]
["E","Heating + Air Con","Hitachi ","RADIATOR","N/A","N/A","Room Temp","AC Unit"]
["E","Heating + Air Con","Hitachi ","RADIATOR","N/A","N/A","Room Temp","Wired Controller"]
["A","Heating + Air Con","LG","WET UFH","NO","N/A","Room Temp","Room Thimble Sensor"]
["A","Heating + Air Con","LG","WET UFH","NO","N/A","Room Temp","AC Unit"]
["A","Heating + Air Con","LG","WET UFH","NO","N/A","Room Temp","Wired Controller"]
["B","Heating + Air Con","LG","WET UFH","YES","TBA","Room Temp","Room Thimble Sensor"]
["B","Heating + Air Con","LG","WET UFH","YES","TBA","Room Temp","AC Unit"]
["B","Heating + Air Con","LG","WET UFH","YES","TBA","Room Temp","Wired Controller"]
["B","Heating + Air Con","LG","WET UFH","YES","25 °C","Room Temp","Room Thimble Sensor"]
["B","Heating + Air Con","LG","WET UFH","YES","25 °C","Room Temp","AC Unit"]
["B","Heating + Air Con","LG","WET UFH","YES","25 °C","Room Temp","Wired Controller"]
["B","Heating + Air Con","LG","WET UFH","YES","26 °C","Room Temp","Room Thimble Sensor"]
["B","Heating + Air Con","LG","WET UFH","YES","26 °C","Room Temp","AC Unit"]
["B","Heating + Air Con","LG","WET UFH","YES","26 °C","Room Temp","Wired Controller"]
["B","Heating + Air Con","LG","WET UFH","YES","27 °C","Room Temp","Room Thimble Sensor"]
["B","Heating + Air Con","LG","WET UFH","YES","27 °C","Room Temp","AC Unit"]
["B","Heating + Air Con","LG","WET UFH","YES","27 °C","Room Temp","Wired Controller"]
["B","Heating + Air Con","LG","WET UFH","YES","28 °C","Room Temp","Room Thimble Sensor"]
["B","Heating + Air Con","LG","WET UFH","YES","28 °C","Room Temp","AC Unit"]
["B","Heating + Air Con","LG","WET UFH","YES","28 °C","Room Temp","Wired Controller"]
["B","Heating + Air Con","LG","WET UFH","YES","29 °C","Room Temp","Room Thimble Sensor"]
["B","Heating + Air Con","LG","WET UFH","YES","29 °C","Room Temp","AC Unit"]
["B","Heating + Air Con","LG","WET UFH","YES","29 °C","Room Temp","Wired Controller"]
["B","Heating + Air Con","LG","WET UFH","YES","30 °C","Room Temp","Room Thimble Sensor"]
["B","Heating + Air Con","LG","WET UFH","YES","30 °C","Room Temp","AC Unit"]
["B","Heating + Air Con","LG","WET UFH","YES","30 °C","Room Temp","Wired Controller"]
["B","Heating + Air Con","LG","WET UFH","YES","31 °C","Room Temp","Room Thimble Sensor"]
["B","Heating + Air Con","LG","WET UFH","YES","31 °C","Room Temp","AC Unit"]
["B","Heating + Air Con","LG","WET UFH","YES","31 °C","Room Temp","Wired Controller"]
["B","Heating + Air Con","LG","WET UFH","YES","32 °C","Room Temp","Room Thimble Sensor"]
["B","Heating + Air Con","LG","WET UFH","YES","32 °C","Room Temp","AC Unit"]
["B","Heating + Air Con","LG","WET UFH","YES","32 °C","Room Temp","Wired Controller"]
["B","Heating + Air Con","LG","WET UFH","YES","33 °C","Room Temp","Room Thimble Sensor"]
["B","Heating + Air Con","LG","WET UFH","YES","33 °C","Room Temp","AC Unit"]
["B","Heating + Air Con","LG","WET UFH","YES","33 °C","Room Temp","Wired Controller"]
["B","Heating + Air Con","LG","WET UFH","YES","34 °C","Room Temp","Room Thimble Sensor"]
["B","Heating + Air Con","LG","WET UFH","YES","34 °C","Room Temp","AC Unit"]
["B","Heating + Air Con","LG","WET UFH","YES","34 °C","Room Temp","Wired Controller"]
["B","Heating + Air Con","LG","WET UFH","YES","35 °C","Room Temp","Room Thimble Sensor"]
["B","Heating + Air Con","LG","WET UFH","YES","35 °C","Room Temp","AC Unit"]
["B","Heating + Air Con","LG","WET UFH","YES","35 °C","Room Temp","Wired Controller"]
["B","Heating + Air Con","LG","WET UFH","YES","36 °C","Room Temp","Room Thimble Sensor"]
["B","Heating + Air Con","LG","WET UFH","YES","36 °C","Room Temp","AC Unit"]
["B","Heating + Air Con","LG","WET UFH","YES","36 °C","Room Temp","Wired Controller"]
["B","Heating + Air Con","LG","WET UFH","YES","37 °C","Room Temp","Room Thimble Sensor"]
["B","Heating + Air Con","LG","WET UFH","YES","37 °C","Room Temp","AC Unit"]
["B","Heating + Air Con","LG","WET UFH","YES","37 °C","Room Temp","Wired Controller"]
["B","Heating + Air Con","LG","WET UFH","YES","38 °C","Room Temp","Room Thimble Sensor"]
["B","Heating + Air Con","LG","WET UFH","YES","38 °C","Room Temp","AC Unit"]
["B","Heating + Air Con","LG","WET UFH","YES","38 °C","Room Temp","Wired Controller"]
["B","Heating + Air Con","LG","WET UFH","YES","39 °C","Room Temp","Room Thimble Sensor"]
["B","Heating + Air Con","LG","WET UFH","YES","39 °C","Room Temp","AC Unit"]
["B","Heating + Air Con","LG","WET UFH","YES","39 °C","Room Temp","Wired Controller"]
["B","Heating + Air Con","LG","WET UFH","YES","40 °C","Room Temp","Room Thimble Sensor"]
["B","Heating + Air Con","LG","WET UFH","YES","40 °C","Room Temp","AC Unit"]
["B","Heating + Air Con","LG","WET UFH","YES","40 °C","Room Temp","Wired Controller"]
["C","Heating + Air Con","LG","ELECTRIC UFH","NO","N/A","Room Temp","Room Thimble Sensor"]
["C","Heating + Air Con","LG","ELECTRIC UFH","NO","N/A","Room Temp","AC Unit"]
["C","Heating + Air Con","LG","ELECTRIC UFH","NO","N/A","Room Temp","Wired Controller"]
["D","Heating + Air Con","LG","ELECTRIC UFH","YES","TBA","Room Temp","Room Thimble Sensor"]
["D","Heating + Air Con","LG","ELECTRIC UFH","YES","TBA","Room Temp","AC Unit"]
["D","Heating + Air Con","LG","ELECTRIC UFH","YES","TBA","Room Temp","Wired Controller"]
["D","Heating + Air Con","LG","ELECTRIC UFH","YES","25 °C","Room Temp","Room Thimble Sensor"]
["D","Heating + Air Con","LG","ELECTRIC UFH","YES","25 °C","Room Temp","AC Unit"]
["D","Heating + Air Con","LG","ELECTRIC UFH","YES","25 °C","Room Temp","Wired Controller"]
["D","Heating + Air Con","LG","ELECTRIC UFH","YES","26 °C","Room Temp","Room Thimble Sensor"]
["D","Heating + Air Con","LG","ELECTRIC UFH","YES","26 °C","Room Temp","AC Unit"]
["D","Heating + Air Con","LG","ELECTRIC UFH","YES","26 °C","Room Temp","Wired Controller"]
["D","Heating + Air Con","LG","ELECTRIC UFH","YES","27 °C","Room Temp","Room Thimble Sensor"]
["D","Heating + Air Con","LG","ELECTRIC UFH","YES","27 °C","Room Temp","AC Unit"]
["D","Heating + Air Con","LG","ELECTRIC UFH","YES","27 °C","Room Temp","Wired Controller"]
["D","Heating + Air Con","LG","ELECTRIC UFH","YES","28 °C","Room Temp","Room Thimble Sensor"]
["D","Heating + Air Con","LG","ELECTRIC UFH","YES","28 °C","Room Temp","AC Unit"]
["D","Heating + Air Con","LG","ELECTRIC UFH","YES","28 °C","Room Temp","Wired Controller"]
["D","Heating + Air Con","LG","ELECTRIC UFH","YES","29 °C","Room Temp","Room Thimble Sensor"]
["D","Heating + Air Con","LG","ELECTRIC UFH","YES","29 °C","Room Temp","AC Unit"]
["D","Heating + Air Con","LG","ELECTRIC UFH","YES","29 °C","Room Temp","Wired Controller"]
["D","Heating + Air Con","LG","ELECTRIC UFH","YES","30 °C","Room Temp","Room Thimble Sensor"]
["D","Heating + Air Con","LG","ELECTRIC UFH","YES","30 °C","Room Temp","AC Unit"]
["D","Heating + Air Con","LG","ELECTRIC UFH","YES","30 °C","Room Temp","Wired Controller"]
["D","Heating + Air Con","LG","ELECTRIC UFH","YES","31 °C","Room Temp","Room Thimble Sensor"]
["D","Heating + Air Con","LG","ELECTRIC UFH","YES","31 °C","Room Temp","AC Unit"]
["D","Heating + Air Con","LG","ELECTRIC UFH","YES","31 °C","Room Temp","Wired Controller"]
["D","Heating + Air Con","LG","ELECTRIC UFH","YES","32 °C","Room Temp","Room Thimble Sensor"]
["D","Heating + Air Con","LG","ELECTRIC UFH","YES","32 °C","Room Temp","AC Unit"]
["D","Heating + Air Con","LG","ELECTRIC UFH","YES","32 °C","Room Temp","Wired Controller"]
["D","Heating + Air Con","LG","ELECTRIC UFH","YES","33 °C","Room Temp","Room Thimble Sensor"]
["D","Heating + Air Con","LG","ELECTRIC UFH","YES","33 °C","Room Temp","AC Unit"]
["D","Heating + Air Con","LG","ELECTRIC UFH","YES","33 °C","Room Temp","Wired Controller"]
["D","Heating + Air Con","LG","ELECTRIC UFH","YES","34 °C","Room Temp","Room Thimble Sensor"]
["D","Heating + Air Con","LG","ELECTRIC UFH","YES","34 °C","Room Temp","AC Unit"]
["D","Heating + Air Con","LG","ELECTRIC UFH","YES","34 °C","Room Temp","Wired Controller"]
["D","Heating + Air Con","LG","ELECTRIC UFH","YES","35 °C","Room Temp","Room Thimble Sensor"]
["D","Heating + Air Con","LG","ELECTRIC UFH","YES","35 °C","Room Temp","AC Unit"]
["D","Heating + Air Con","LG","ELECTRIC UFH","YES","35 °C","Room Temp","Wired Controller"]
["D","Heating + Air Con","LG","ELECTRIC UFH","YES","36 °C","Room Temp","Room Thimble Sensor"]
["D","Heating + Air Con","LG","ELECTRIC UFH","YES","36 °C","Room Temp","AC Unit"]
["D","Heating + Air Con","LG","ELECTRIC UFH","YES","36 °C","Room Temp","Wired Controller"]
["D","Heating + Air Con","LG","ELECTRIC UFH","YES","37 °C","Room Temp","Room Thimble Sensor"]
["D","Heating + Air Con","LG","ELECTRIC UFH","YES","37 °C","Room Temp","AC Unit"]
["D","Heating + Air Con","LG","ELECTRIC UFH","YES","37 °C","Room Temp","Wired Controller"]
["D","Heating + Air Con","LG","ELECTRIC UFH","YES","38 °C","Room Temp","Room Thimble Sensor"]
["D","Heating + Air Con","LG","ELECTRIC UFH","YES","38 °C","Room Temp","AC Unit"]
["D","Heating + Air Con","LG","ELECTRIC UFH","YES","38 °C","Room Temp","Wired Controller"]
["D","Heating + Air Con","LG","ELECTRIC UFH","YES","39 °C","Room Temp","Room Thimble Sensor"]
["D","Heating + Air Con","LG","ELECTRIC UFH","YES","39 °C","Room Temp","AC Unit"]
["D","Heating + Air Con","LG","ELECTRIC UFH","YES","39 °C","Room Temp","Wired Controller"]
["D","Heating + Air Con","LG","ELECTRIC UFH","YES","40 °C","Room Temp","Room Thimble Sensor"]
["D","Heating + Air Con","LG","ELECTRIC UFH","YES","40 °C","Room Temp","AC Unit"]
["D","Heating + Air Con","LG","ELECTRIC UFH","YES","40 °C","Room Temp","Wired Controller"]
["E","Heating + Air Con","LG","RADIATOR","N/A","N/A","Room Temp","Room Thimble Sensor"]
["E","Heating + Air Con","LG","RADIATOR","N/A","N/A","Room Temp","AC Unit"]
["E","Heating + Air Con","LG","RADIATOR","N/A","N/A","Room Temp","Wired Controller"]
["A","Heating + Air Con","Other","WET UFH","NO","N/A","Room Temp","Room Thimble Sensor"]
["A","Heating + Air Con","Other","WET UFH","NO","N/A","Room Temp","AC Unit"]
["A","Heating + Air Con","Other","WET UFH","NO","N/A","Room Temp","Wired Controller"]
["B","Heating + Air Con","Other","WET UFH","YES","TBA","Room Temp","Room Thimble Sensor"]
["B","Heating + Air Con","Other","WET UFH","YES","TBA","Room Temp","AC Unit"]
["B","Heating + Air Con","Other","WET UFH","YES","TBA","Room Temp","Wired Controller"]
["B","Heating + Air Con","Other","WET UFH","YES","25 °C","Room Temp","Room Thimble Sensor"]
["B","Heating + Air Con","Other","WET UFH","YES","25 °C","Room Temp","AC Unit"]
["B","Heating + Air Con","Other","WET UFH","YES","25 °C","Room Temp","Wired Controller"]
["B","Heating + Air Con","Other","WET UFH","YES","26 °C","Room Temp","Room Thimble Sensor"]
["B","Heating + Air Con","Other","WET UFH","YES","26 °C","Room Temp","AC Unit"]
["B","Heating + Air Con","Other","WET UFH","YES","26 °C","Room Temp","Wired Controller"]
["B","Heating + Air Con","Other","WET UFH","YES","27 °C","Room Temp","Room Thimble Sensor"]
["B","Heating + Air Con","Other","WET UFH","YES","27 °C","Room Temp","AC Unit"]
["B","Heating + Air Con","Other","WET UFH","YES","27 °C","Room Temp","Wired Controller"]
["B","Heating + Air Con","Other","WET UFH","YES","28 °C","Room Temp","Room Thimble Sensor"]
["B","Heating + Air Con","Other","WET UFH","YES","28 °C","Room Temp","AC Unit"]
["B","Heating + Air Con","Other","WET UFH","YES","28 °C","Room Temp","Wired Controller"]
["B","Heating + Air Con","Other","WET UFH","YES","29 °C","Room Temp","Room Thimble Sensor"]
["B","Heating + Air Con","Other","WET UFH","YES","29 °C","Room Temp","AC Unit"]
["B","Heating + Air Con","Other","WET UFH","YES","29 °C","Room Temp","Wired Controller"]
["B","Heating + Air Con","Other","WET UFH","YES","30 °C","Room Temp","Room Thimble Sensor"]
["B","Heating + Air Con","Other","WET UFH","YES","30 °C","Room Temp","AC Unit"]
["B","Heating + Air Con","Other","WET UFH","YES","30 °C","Room Temp","Wired Controller"]
["B","Heating + Air Con","Other","WET UFH","YES","31 °C","Room Temp","Room Thimble Sensor"]
["B","Heating + Air Con","Other","WET UFH","YES","31 °C","Room Temp","AC Unit"]
["B","Heating + Air Con","Other","WET UFH","YES","31 °C","Room Temp","Wired Controller"]
["B","Heating + Air Con","Other","WET UFH","YES","32 °C","Room Temp","Room Thimble Sensor"]
["B","Heating + Air Con","Other","WET UFH","YES","32 °C","Room Temp","AC Unit"]
["B","Heating + Air Con","Other","WET UFH","YES","32 °C","Room Temp","Wired Controller"]
["B","Heating + Air Con","Other","WET UFH","YES","33 °C","Room Temp","Room Thimble Sensor"]
["B","Heating + Air Con","Other","WET UFH","YES","33 °C","Room Temp","AC Unit"]
["B","Heating + Air Con","Other","WET UFH","YES","33 °C","Room Temp","Wired Controller"]
["B","Heating + Air Con","Other","WET UFH","YES","34 °C","Room Temp","Room Thimble Sensor"]
["B","Heating + Air Con","Other","WET UFH","YES","34 °C","Room Temp","AC Unit"]
["B","Heating + Air Con","Other","WET UFH","YES","34 °C","Room Temp","Wired Controller"]
["B","Heating + Air Con","Other","WET UFH","YES","35 °C","Room Temp","Room Thimble Sensor"]
["B","Heating + Air Con","Other","WET UFH","YES","35 °C","Room Temp","AC Unit"]
["B","Heating + Air Con","Other","WET UFH","YES","35 °C","Room Temp","Wired Controller"]
["B","Heating + Air Con","Other","WET UFH","YES","36 °C","Room Temp","Room Thimble Sensor"]
["B","Heating + Air Con","Other","WET UFH","YES","36 °C","Room Temp","AC Unit"]
["B","Heating + Air Con","Other","WET UFH","YES","36 °C","Room Temp","Wired Controller"]
["B","Heating + Air Con","Other","WET UFH","YES","37 °C","Room Temp","Room Thimble Sensor"]
["B","Heating + Air Con","Other","WET UFH","YES","37 °C","Room Temp","AC Unit"]
["B","Heating + Air Con","Other","WET UFH","YES","37 °C","Room Temp","Wired Controller"]
["B","Heating + Air Con","Other","WET UFH","YES","38 °C","Room Temp","Room Thimble Sensor"]
["B","Heating + Air Con","Other","WET UFH","YES","38 °C","Room Temp","AC Unit"]
["B","Heating + Air Con","Other","WET UFH","YES","38 °C","Room Temp","Wired Controller"]
["B","Heating + Air Con","Other","WET UFH","YES","39 °C","Room Temp","Room Thimble Sensor"]
["B","Heating + Air Con","Other","WET UFH","YES","39 °C","Room Temp","AC Unit"]
["B","Heating + Air Con","Other","WET UFH","YES","39 °C","Room Temp","Wired Controller"]
["B","Heating + Air Con","Other","WET UFH","YES","40 °C","Room Temp","Room Thimble Sensor"]
["B","Heating + Air Con","Other","WET UFH","YES","40 °C","Room Temp","AC Unit"]
["B","Heating + Air Con","Other","WET UFH","YES","40 °C","Room Temp","Wired Controller"]
["C","Heating + Air Con","Other","ELECTRIC UFH","NO","N/A","Room Temp","Room Thimble Sensor"]
["C","Heating + Air Con","Other","ELECTRIC UFH","NO","N/A","Room Temp","AC Unit"]
["C","Heating + Air Con","Other","ELECTRIC UFH","NO","N/A","Room Temp","Wired Controller"]
["D","Heating + Air Con","Other","ELECTRIC UFH","YES","TBA","Room Temp","Room Thimble Sensor"]
["D","Heating + Air Con","Other","ELECTRIC UFH","YES","TBA","Room Temp","AC Unit"]
["D","Heating + Air Con","Other","ELECTRIC UFH","YES","TBA","Room Temp","Wired Controller"]
["D","Heating + Air Con","Other","ELECTRIC UFH","YES","25 °C","Room Temp","Room Thimble Sensor"]
["D","Heating + Air Con","Other","ELECTRIC UFH","YES","25 °C","Room Temp","AC Unit"]
["D","Heating + Air Con","Other","ELECTRIC UFH","YES","25 °C","Room Temp","Wired Controller"]
["D","Heating + Air Con","Other","ELECTRIC UFH","YES","26 °C","Room Temp","Room Thimble Sensor"]
["D","Heating + Air Con","Other","ELECTRIC UFH","YES","26 °C","Room Temp","AC Unit"]
["D","Heating + Air Con","Other","ELECTRIC UFH","YES","26 °C","Room Temp","Wired Controller"]
["D","Heating + Air Con","Other","ELECTRIC UFH","YES","27 °C","Room Temp","Room Thimble Sensor"]
["D","Heating + Air Con","Other","ELECTRIC UFH","YES","27 °C","Room Temp","AC Unit"]
["D","Heating + Air Con","Other","ELECTRIC UFH","YES","27 °C","Room Temp","Wired Controller"]
["D","Heating + Air Con","Other","ELECTRIC UFH","YES","28 °C","Room Temp","Room Thimble Sensor"]
["D","Heating + Air Con","Other","ELECTRIC UFH","YES","28 °C","Room Temp","AC Unit"]
["D","Heating + Air Con","Other","ELECTRIC UFH","YES","28 °C","Room Temp","Wired Controller"]
["D","Heating + Air Con","Other","ELECTRIC UFH","YES","29 °C","Room Temp","Room Thimble Sensor"]
["D","Heating + Air Con","Other","ELECTRIC UFH","YES","29 °C","Room Temp","AC Unit"]
["D","Heating + Air Con","Other","ELECTRIC UFH","YES","29 °C","Room Temp","Wired Controller"]
["D","Heating + Air Con","Other","ELECTRIC UFH","YES","30 °C","Room Temp","Room Thimble Sensor"]
["D","Heating + Air Con","Other","ELECTRIC UFH","YES","30 °C","Room Temp","AC Unit"]
["D","Heating + Air Con","Other","ELECTRIC UFH","YES","30 °C","Room Temp","Wired Controller"]
["D","Heating + Air Con","Other","ELECTRIC UFH","YES","31 °C","Room Temp","Room Thimble Sensor"]
["D","Heating + Air Con","Other","ELECTRIC UFH","YES","31 °C","Room Temp","AC Unit"]
["D","Heating + Air Con","Other","ELECTRIC UFH","YES","31 °C","Room Temp","Wired Controller"]
["D","Heating + Air Con","Other","ELECTRIC UFH","YES","32 °C","Room Temp","Room Thimble Sensor"]
["D","Heating + Air Con","Other","ELECTRIC UFH","YES","32 °C","Room Temp","AC Unit"]
["D","Heating + Air Con","Other","ELECTRIC UFH","YES","32 °C","Room Temp","Wired Controller"]
["D","Heating + Air Con","Other","ELECTRIC UFH","YES","33 °C","Room Temp","Room Thimble Sensor"]
["D","Heating + Air Con","Other","ELECTRIC UFH","YES","33 °C","Room Temp","AC Unit"]
["D","Heating + Air Con","Other","ELECTRIC UFH","YES","33 °C","Room Temp","Wired Controller"]
["D","Heating + Air Con","Other","ELECTRIC UFH","YES","34 °C","Room Temp","Room Thimble Sensor"]
["D","Heating + Air Con","Other","ELECTRIC UFH","YES","34 °C","Room Temp","AC Unit"]
["D","Heating + Air Con","Other","ELECTRIC UFH","YES","34 °C","Room Temp","Wired Controller"]
["D","Heating + Air Con","Other","ELECTRIC UFH","YES","35 °C","Room Temp","Room Thimble Sensor"]
["D","Heating + Air Con","Other","ELECTRIC UFH","YES","35 °C","Room Temp","AC Unit"]
["D","Heating + Air Con","Other","ELECTRIC UFH","YES","35 °C","Room Temp","Wired Controller"]
["D","Heating + Air Con","Other","ELECTRIC UFH","YES","36 °C","Room Temp","Room Thimble Sensor"]
["D","Heating + Air Con","Other","ELECTRIC UFH","YES","36 °C","Room Temp","AC Unit"]
["D","Heating + Air Con","Other","ELECTRIC UFH","YES","36 °C","Room Temp","Wired Controller"]
["D","Heating + Air Con","Other","ELECTRIC UFH","YES","37 °C","Room Temp","Room Thimble Sensor"]
["D","Heating + Air Con","Other","ELECTRIC UFH","YES","37 °C","Room Temp","AC Unit"]
["D","Heating + Air Con","Other","ELECTRIC UFH","YES","37 °C","Room Temp","Wired Controller"]
["D","Heating + Air Con","Other","ELECTRIC UFH","YES","38 °C","Room Temp","Room Thimble Sensor"]
["D","Heating + Air Con","Other","ELECTRIC UFH","YES","38 °C","Room Temp","AC Unit"]
["D","Heating + Air Con","Other","ELECTRIC UFH","YES","38 °C","Room Temp","Wired Controller"]
["D","Heating + Air Con","Other","ELECTRIC UFH","YES","39 °C","Room Temp","Room Thimble Sensor"]
["D","Heating + Air Con","Other","ELECTRIC UFH","YES","39 °C","Room Temp","AC Unit"]
["D","Heating + Air Con","Other","ELECTRIC UFH","YES","39 °C","Room Temp","Wired Controller"]
["D","Heating + Air Con","Other","ELECTRIC UFH","YES","40 °C","Room Temp","Room Thimble Sensor"]
["D","Heating + Air Con","Other","ELECTRIC UFH","YES","40 °C","Room Temp","AC Unit"]
["D","Heating + Air Con","Other","ELECTRIC UFH","YES","40 °C","Room Temp","Wired Controller"]
["E","Heating + Air Con","Other","RADIATOR","N/A","N/A","Room Temp","Room Thimble Sensor"]
["E","Heating + Air Con","Other","RADIATOR","N/A","N/A","Room Temp","AC Unit"]
["E","Heating + Air Con","Other","RADIATOR","N/A","N/A","Room Temp","Wired Controller"]
["F","AC only","Daikin","N/A","N/A","N/A","Room Temp","Room Thimble Sensor"]
["F","AC only","Daikin","N/A","N/A","N/A","Room Temp","AC Unit"]
["F","AC only","Daikin","N/A","N/A","N/A","Room Temp","Wired Controller"]
["F","AC only","Mitsubishi","N/A","N/A","N/A","Room Temp","Room Thimble Sensor"]
["F","AC only","Mitsubishi","N/A","N/A","N/A","Room Temp","AC Unit"]
["F","AC only","Mitsubishi","N/A","N/A","N/A","Room Temp","Wired Controller"]
["F","AC only","Toshiba","N/A","N/A","N/A","Room Temp","Room Thimble Sensor"]
["F","AC only","Toshiba","N/A","N/A","N/A","Room Temp","AC Unit"]
["F","AC only","Toshiba","N/A","N/A","N/A","Room Temp","Wired Controller"]
["F","AC only","Sanyo ","N/A","N/A","N/A","Room Temp","Room Thimble Sensor"]
["F","AC only","Sanyo ","N/A","N/A","N/A","Room Temp","AC Unit"]
["F","AC only","Sanyo ","N/A","N/A","N/A","Room Temp","Wired Controller"]
["F","AC only","Panasonic ","N/A","N/A","N/A","Room Temp","Room Thimble Sensor"]
["F","AC only","Panasonic ","N/A","N/A","N/A","Room Temp","AC Unit"]
["F","AC only","Panasonic ","N/A","N/A","N/A","Room Temp","Wired Controller"]
["F","AC only","Fujitsu ","N/A","N/A","N/A","Room Temp","Room Thimble Sensor"]
["F","AC only","Fujitsu ","N/A","N/A","N/A","Room Temp","AC Unit"]
["F","AC only","Fujitsu ","N/A","N/A","N/A","Room Temp","Wired Controller"]
["F","AC only","Hitachi ","N/A","N/A","N/A","Room Temp","Room Thimble Sensor"]
["F","AC only","Hitachi ","N/A","N/A","N/A","Room Temp","AC Unit"]
["F","AC only","Hitachi ","N/A","N/A","N/A","Room Temp","Wired Controller"]
["F","AC only","LG","N/A","N/A","N/A","Room Temp","Room Thimble Sensor"]
["F","AC only","LG","N/A","N/A","N/A","Room Temp","AC Unit"]
["F","AC only","LG","N/A","N/A","N/A","Room Temp","Wired Controller"]
["F","AC only","Other","N/A","N/A","N/A","Room Temp","Room Thimble Sensor"]
["F","AC only","Other","N/A","N/A","N/A","Room Temp","AC Unit"]
["F","AC only","Other","N/A","N/A","N/A","Room Temp","Wired Controller"]
["G","Heating","N/A","WET UFH","NO","N/A","Room Temp","Room Thimble Sensor"]
["G","Heating","N/A","WET UFH","NO","N/A","Room Temp","Wired Controller"]
["I","Heating","N/A","WET UFH","NO","N/A","Floor Temp","Floor Probe"]
["H","Heating","N/A","WET UFH","YES","TBA","Room Temp","Room Thimble Sensor"]
["H","Heating","N/A","WET UFH","YES","TBA","Room Temp","Wired Controller"]
["H","Heating","N/A","WET UFH","YES","25 °C","Room Temp","Room Thimble Sensor"]
["H","Heating","N/A","WET UFH","YES","25 °C","Room Temp","Wired Controller"]
["H","Heating","N/A","WET UFH","YES","26 °C","Room Temp","Room Thimble Sensor"]
["H","Heating","N/A","WET UFH","YES","26 °C","Room Temp","Wired Controller"]
["H","Heating","N/A","WET UFH","YES","27 °C","Room Temp","Room Thimble Sensor"]
["H","Heating","N/A","WET UFH","YES","27 °C","Room Temp","Wired Controller"]
["H","Heating","N/A","WET UFH","YES","28 °C","Room Temp","Room Thimble Sensor"]
["H","Heating","N/A","WET UFH","YES","28 °C","Room Temp","Wired Controller"]
["H","Heating","N/A","WET UFH","YES","29 °C","Room Temp","Room Thimble Sensor"]
["H","Heating","N/A","WET UFH","YES","29 °C","Room Temp","Wired Controller"]
["H","Heating","N/A","WET UFH","YES","30 °C","Room Temp","Room Thimble Sensor"]
["H","Heating","N/A","WET UFH","YES","30 °C","Room Temp","Wired Controller"]
["H","Heating","N/A","WET UFH","YES","31 °C","Room Temp","Room Thimble Sensor"]
["H","Heating","N/A","WET UFH","YES","31 °C","Room Temp","Wired Controller"]
["H","Heating","N/A","WET UFH","YES","32 °C","Room Temp","Room Thimble Sensor"]
["H","Heating","N/A","WET UFH","YES","32 °C","Room Temp","Wired Controller"]
["H","Heating","N/A","WET UFH","YES","33 °C","Room Temp","Room Thimble Sensor"]
["H","Heating","N/A","WET UFH","YES","33 °C","Room Temp","Wired Controller"]
["H","Heating","N/A","WET UFH","YES","34 °C","Room Temp","Room Thimble Sensor"]
["H","Heating","N/A","WET UFH","YES","34 °C","Room Temp","Wired Controller"]
["H","Heating","N/A","WET UFH","YES","35 °C","Room Temp","Room Thimble Sensor"]
["H","Heating","N/A","WET UFH","YES","35 °C","Room Temp","Wired Controller"]
["H","Heating","N/A","WET UFH","YES","36 °C","Room Temp","Room Thimble Sensor"]
["H","Heating","N/A","WET UFH","YES","36 °C","Room Temp","Wired Controller"]
["H","Heating","N/A","WET UFH","YES","37 °C","Room Temp","Room Thimble Sensor"]
["H","Heating","N/A","WET UFH","YES","37 °C","Room Temp","Wired Controller"]
["H","Heating","N/A","WET UFH","YES","38 °C","Room Temp","Room Thimble Sensor"]
["H","Heating","N/A","WET UFH","YES","38 °C","Room Temp","Wired Controller"]
["H","Heating","N/A","WET UFH","YES","39 °C","Room Temp","Room Thimble Sensor"]
["H","Heating","N/A","WET UFH","YES","39 °C","Room Temp","Wired Controller"]
["H","Heating","N/A","WET UFH","YES","40 °C","Room Temp","Room Thimble Sensor"]
["H","Heating","N/A","WET UFH","YES","40 °C","Room Temp","Wired Controller"]
["J","Heating","N/A","ELECTRIC UFH","NO","N/A","Room Temp","Room Thimble Sensor"]
["J","Heating","N/A","ELECTRIC UFH","NO","N/A","Room Temp","Wired Controller"]
["L","Heating","N/A","ELECTRIC UFH","NO","N/A","Floor Temp","Floor Probe"]
["K","Heating","N/A","ELECTRIC UFH","YES","TBA","Room Temp","Room Thimble Sensor"]
["K","Heating","N/A","ELECTRIC UFH","YES","TBA","Room Temp","Wired Controller"]
["K","Heating","N/A","ELECTRIC UFH","YES","25 °C","Room Temp","Room Thimble Sensor"]
["K","Heating","N/A","ELECTRIC UFH","YES","25 °C","Room Temp","Wired Controller"]
["K","Heating","N/A","ELECTRIC UFH","YES","26 °C","Room Temp","Room Thimble Sensor"]
["K","Heating","N/A","ELECTRIC UFH","YES","26 °C","Room Temp","Wired Controller"]
["K","Heating","N/A","ELECTRIC UFH","YES","27 °C","Room Temp","Room Thimble Sensor"]
["K","Heating","N/A","ELECTRIC UFH","YES","27 °C","Room Temp","Wired Controller"]
["K","Heating","N/A","ELECTRIC UFH","YES","28 °C","Room Temp","Room Thimble Sensor"]
["K","Heating","N/A","ELECTRIC UFH","YES","28 °C","Room Temp","Wired Controller"]
["K","Heating","N/A","ELECTRIC UFH","YES","29 °C","Room Temp","Room Thimble Sensor"]
["K","Heating","N/A","ELECTRIC UFH","YES","29 °C","Room Temp","Wired Controller"]
["K","Heating","N/A","ELECTRIC UFH","YES","30 °C","Room Temp","Room Thimble Sensor"]
["K","Heating","N/A","ELECTRIC UFH","YES","30 °C","Room Temp","Wired Controller"]
["K","Heating","N/A","ELECTRIC UFH","YES","31 °C","Room Temp","Room Thimble Sensor"]
["K","Heating","N/A","ELECTRIC UFH","YES","31 °C","Room Temp","Wired Controller"]
["K","Heating","N/A","ELECTRIC UFH","YES","32 °C","Room Temp","Room Thimble Sensor"]
["K","Heating","N/A","ELECTRIC UFH","YES","32 °C","Room Temp","Wired Controller"]
["K","Heating","N/A","ELECTRIC UFH","YES","33 °C","Room Temp","Room Thimble Sensor"]
["K","Heating","N/A","ELECTRIC UFH","YES","33 °C","Room Temp","Wired Controller"]
["K","Heating","N/A","ELECTRIC UFH","YES","34 °C","Room Temp","Room Thimble Sensor"]
["K","Heating","N/A","ELECTRIC UFH","YES","34 °C","Room Temp","Wired Controller"]
["K","Heating","N/A","ELECTRIC UFH","YES","35 °C","Room Temp","Room Thimble Sensor"]
["K","Heating","N/A","ELECTRIC UFH","YES","35 °C","Room Temp","Wired Controller"]
["K","Heating","N/A","ELECTRIC UFH","YES","36 °C","Room Temp","Room Thimble Sensor"]
["K","Heating","N/A","ELECTRIC UFH","YES","36 °C","Room Temp","Wired Controller"]
["K","Heating","N/A","ELECTRIC UFH","YES","37 °C","Room Temp","Room Thimble Sensor"]
["K","Heating","N/A","ELECTRIC UFH","YES","37 °C","Room Temp","Wired Controller"]
["K","Heating","N/A","ELECTRIC UFH","YES","38 °C","Room Temp","Room Thimble Sensor"]
["K","Heating","N/A","ELECTRIC UFH","YES","38 °C","Room Temp","Wired Controller"]
["K","Heating","N/A","ELECTRIC UFH","YES","39 °C","Room Temp","Room Thimble Sensor"]
["K","Heating","N/A","ELECTRIC UFH","YES","39 °C","Room Temp","Wired Controller"]
["K","Heating","N/A","ELECTRIC UFH","YES","40 °C","Room Temp","Room Thimble Sensor"]
["K","Heating","N/A","ELECTRIC UFH","YES","40 °C","Room Temp","Wired Controller"]
["M","Heating","N/A","RADIATOR","N/A","N/A","Room Temp","Room Thimble Sensor"]
["M","Heating","N/A","RADIATOR","N/A","N/A","Room Temp","Wired Controller"]
["O","Towel Rad ON/OFF Only","N/A","N/A","N/A","N/A","ON/OFF Only","N/A"]
["P","Towel Rad Temp Control","N/A","RADIATOR","N/A","N/A","Room Temp","Room Thimble Sensor"]
["P","Towel Rad Temp Control","N/A","RADIATOR","N/A","N/A","Room Temp","Wired Controller"]
["N","ON/OFF SWITCH","N/A","N/A","N/A","N/A","ON/OFF Only","N/A"]
["Q","Hot Water ON/OFF","N/A","N/A","N/A","N/A","ON/OFF Only","N/A"]
["R","Hot Water, Temp Control (Valve Only)","N/A","N/A","N/A","N/A","Cylinder Temp","Cylinder Probe"]
["S","Hot Water, Temp Control (Valve & Boiler)","N/A","N/A","N/A","N/A","Cylinder Temp","Cylinder Probe"]
["FA","Heating + FCU","PLEASE SELECT","WET UFH","NO","N/A","Room Temp","Wired Controller"]
["FA","Heating + FCU","Daikin","WET UFH","NO","N/A","Room Temp","Wired Controller"]
["FA","Heating + FCU","Mitsubishi","WET UFH","NO","N/A","Room Temp","Wired Controller"]
["FA","Heating + FCU","Toshiba","WET UFH","NO","N/A","Room Temp","Wired Controller"]
["FA","Heating + FCU","Sanyo ","WET UFH","NO","N/A","Room Temp","Wired Controller"]
["FA","Heating + FCU","Panasonic ","WET UFH","NO","N/A","Room Temp","Wired Controller"]
["FA","Heating + FCU","Fujitsu ","WET UFH","NO","N/A","Room Temp","Wired Controller"]
["FA","Heating + FCU","Hitachi ","WET UFH","NO","N/A","Room Temp","Wired Controller"]
["FA","Heating + FCU","LG","WET UFH","NO","N/A","Room Temp","Wired Controller"]
["FA","Heating + FCU","Other","WET UFH","NO","N/A","Room Temp","Wired Controller"]
["FB","Heating + FCU","PLEASE SELECT","WET UFH","YES","PLEASE SELECT","Room Temp","Wired Controller"]
["FB","Heating + FCU","Daikin","WET UFH","YES","TBA","Room Temp","Wired Controller"]
["FB","Heating + FCU","Daikin","WET UFH","YES","25 °C","Room Temp","Wired Controller"]
["FB","Heating + FCU","Daikin","WET UFH","YES","26 °C","Room Temp","Wired Controller"]
["FB","Heating + FCU","Daikin","WET UFH","YES","27 °C","Room Temp","Wired Controller"]
["FB","Heating + FCU","Daikin","WET UFH","YES","28 °C","Room Temp","Wired Controller"]
["FB","Heating + FCU","Daikin","WET UFH","YES","29 °C","Room Temp","Wired Controller"]
["FB","Heating + FCU","Daikin","WET UFH","YES","30 °C","Room Temp","Wired Controller"]
["FB","Heating + FCU","Daikin","WET UFH","YES","31 °C","Room Temp","Wired Controller"]
["FB","Heating + FCU","Daikin","WET UFH","YES","32 °C","Room Temp","Wired Controller"]
["FB","Heating + FCU","Daikin","WET UFH","YES","33 °C","Room Temp","Wired Controller"]
["FB","Heating + FCU","Daikin","WET UFH","YES","34 °C","Room Temp","Wired Controller"]
["FB","Heating + FCU","Daikin","WET UFH","YES","35 °C","Room Temp","Wired Controller"]
["FB","Heating + FCU","Daikin","WET UFH","YES","36 °C","Room Temp","Wired Controller"]
["FB","Heating + FCU","Daikin","WET UFH","YES","37 °C","Room Temp","Wired Controller"]
["FB","Heating + FCU","Daikin","WET UFH","YES","38 °C","Room Temp","Wired Controller"]
["FB","Heating + FCU","Daikin","WET UFH","YES","39 °C","Room Temp","Wired Controller"]
["FB","Heating + FCU","Daikin","WET UFH","YES","40 °C","Room Temp","Wired Controller"]
["FB","Heating + FCU","Mitsubishi","WET UFH","YES","TBA","Room Temp","Wired Controller"]
["FB","Heating + FCU","Mitsubishi","WET UFH","YES","25 °C","Room Temp","Wired Controller"]
["FB","Heating + FCU","Mitsubishi","WET UFH","YES","26 °C","Room Temp","Wired Controller"]
["FB","Heating + FCU","Mitsubishi","WET UFH","YES","27 °C","Room Temp","Wired Controller"]
["FB","Heating + FCU","Mitsubishi","WET UFH","YES","28 °C","Room Temp","Wired Controller"]
["FB","Heating + FCU","Mitsubishi","WET UFH","YES","29 °C","Room Temp","Wired Controller"]
["FB","Heating + FCU","Mitsubishi","WET UFH","YES","30 °C","Room Temp","Wired Controller"]
["FB","Heating + FCU","Mitsubishi","WET UFH","YES","31 °C","Room Temp","Wired Controller"]
["FB","Heating + FCU","Mitsubishi","WET UFH","YES","32 °C","Room Temp","Wired Controller"]
["FB","Heating + FCU","Mitsubishi","WET UFH","YES","33 °C","Room Temp","Wired Controller"]
["FB","Heating + FCU","Mitsubishi","WET UFH","YES","34 °C","Room Temp","Wired Controller"]
["FB","Heating + FCU","Mitsubishi","WET UFH","YES","35 °C","Room Temp","Wired Controller"]
["FB","Heating + FCU","Mitsubishi","WET UFH","YES","36 °C","Room Temp","Wired Controller"]
["FB","Heating + FCU","Mitsubishi","WET UFH","YES","37 °C","Room Temp","Wired Controller"]
["FB","Heating + FCU","Mitsubishi","WET UFH","YES","38 °C","Room Temp","Wired Controller"]
["FB","Heating + FCU","Mitsubishi","WET UFH","YES","39 °C","Room Temp","Wired Controller"]
["FB","Heating + FCU","Mitsubishi","WET UFH","YES","40 °C","Room Temp","Wired Controller"]
["FB","Heating + FCU","Toshiba","WET UFH","YES","TBA","Room Temp","Wired Controller"]
["FB","Heating + FCU","Toshiba","WET UFH","YES","25 °C","Room Temp","Wired Controller"]
["FB","Heating + FCU","Toshiba","WET UFH","YES","26 °C","Room Temp","Wired Controller"]
["FB","Heating + FCU","Toshiba","WET UFH","YES","27 °C","Room Temp","Wired Controller"]
["FB","Heating + FCU","Toshiba","WET UFH","YES","28 °C","Room Temp","Wired Controller"]
["FB","Heating + FCU","Toshiba","WET UFH","YES","29 °C","Room Temp","Wired Controller"]
["FB","Heating + FCU","Toshiba","WET UFH","YES","30 °C","Room Temp","Wired Controller"]
["FB","Heating + FCU","Toshiba","WET UFH","YES","31 °C","Room Temp","Wired Controller"]
["FB","Heating + FCU","Toshiba","WET UFH","YES","32 °C","Room Temp","Wired Controller"]
["FB","Heating + FCU","Toshiba","WET UFH","YES","33 °C","Room Temp","Wired Controller"]
["FB","Heating + FCU","Toshiba","WET UFH","YES","34 °C","Room Temp","Wired Controller"]
["FB","Heating + FCU","Toshiba","WET UFH","YES","35 °C","Room Temp","Wired Controller"]
["FB","Heating + FCU","Toshiba","WET UFH","YES","36 °C","Room Temp","Wired Controller"]
["FB","Heating + FCU","Toshiba","WET UFH","YES","37 °C","Room Temp","Wired Controller"]
["FB","Heating + FCU","Toshiba","WET UFH","YES","38 °C","Room Temp","Wired Controller"]
["FB","Heating + FCU","Toshiba","WET UFH","YES","39 °C","Room Temp","Wired Controller"]
["FB","Heating + FCU","Toshiba","WET UFH","YES","40 °C","Room Temp","Wired Controller"]
["FB","Heating + FCU","Sanyo ","WET UFH","YES","TBA","Room Temp","Wired Controller"]
["FB","Heating + FCU","Sanyo ","WET UFH","YES","25 °C","Room Temp","Wired Controller"]
["FB","Heating + FCU","Sanyo ","WET UFH","YES","26 °C","Room Temp","Wired Controller"]
["FB","Heating + FCU","Sanyo ","WET UFH","YES","27 °C","Room Temp","Wired Controller"]
["FB","Heating + FCU","Sanyo ","WET UFH","YES","28 °C","Room Temp","Wired Controller"]
["FB","Heating + FCU","Sanyo ","WET UFH","YES","29 °C","Room Temp","Wired Controller"]
["FB","Heating + FCU","Sanyo ","WET UFH","YES","30 °C","Room Temp","Wired Controller"]
["FB","Heating + FCU","Sanyo ","WET UFH","YES","31 °C","Room Temp","Wired Controller"]
["FB","Heating + FCU","Sanyo ","WET UFH","YES","32 °C","Room Temp","Wired Controller"]
["FB","Heating + FCU","Sanyo ","WET UFH","YES","33 °C","Room Temp","Wired Controller"]
["FB","Heating + FCU","Sanyo ","WET UFH","YES","34 °C","Room Temp","Wired Controller"]
["FB","Heating + FCU","Sanyo ","WET UFH","YES","35 °C","Room Temp","Wired Controller"]
["FB","Heating + FCU","Sanyo ","WET UFH","YES","36 °C","Room Temp","Wired Controller"]
["FB","Heating + FCU","Sanyo ","WET UFH","YES","37 °C","Room Temp","Wired Controller"]
["FB","Heating + FCU","Sanyo ","WET UFH","YES","38 °C","Room Temp","Wired Controller"]
["FB","Heating + FCU","Sanyo ","WET UFH","YES","39 °C","Room Temp","Wired Controller"]
["FB","Heating + FCU","Sanyo ","WET UFH","YES","40 °C","Room Temp","Wired Controller"]
["FB","Heating + FCU","Panasonic ","WET UFH","YES","TBA","Room Temp","Wired Controller"]
["FB","Heating + FCU","Panasonic ","WET UFH","YES","25 °C","Room Temp","Wired Controller"]
["FB","Heating + FCU","Panasonic ","WET UFH","YES","26 °C","Room Temp","Wired Controller"]
["FB","Heating + FCU","Panasonic ","WET UFH","YES","27 °C","Room Temp","Wired Controller"]
["FB","Heating + FCU","Panasonic ","WET UFH","YES","28 °C","Room Temp","Wired Controller"]
["FB","Heating + FCU","Panasonic ","WET UFH","YES","29 °C","Room Temp","Wired Controller"]
["FB","Heating + FCU","Panasonic ","WET UFH","YES","30 °C","Room Temp","Wired Controller"]
["FB","Heating + FCU","Panasonic ","WET UFH","YES","31 °C","Room Temp","Wired Controller"]
["FB","Heating + FCU","Panasonic ","WET UFH","YES","32 °C","Room Temp","Wired Controller"]
["FB","Heating + FCU","Panasonic ","WET UFH","YES","33 °C","Room Temp","Wired Controller"]
["FB","Heating + FCU","Panasonic ","WET UFH","YES","34 °C","Room Temp","Wired Controller"]
["FB","Heating + FCU","Panasonic ","WET UFH","YES","35 °C","Room Temp","Wired Controller"]
["FB","Heating + FCU","Panasonic ","WET UFH","YES","36 °C","Room Temp","Wired Controller"]
["FB","Heating + FCU","Panasonic ","WET UFH","YES","37 °C","Room Temp","Wired Controller"]
["FB","Heating + FCU","Panasonic ","WET UFH","YES","38 °C","Room Temp","Wired Controller"]
["FB","Heating + FCU","Panasonic ","WET UFH","YES","39 °C","Room Temp","Wired Controller"]
["FB","Heating + FCU","Panasonic ","WET UFH","YES","40 °C","Room Temp","Wired Controller"]
["FB","Heating + FCU","Fujitsu ","WET UFH","YES","TBA","Room Temp","Wired Controller"]
["FB","Heating + FCU","Fujitsu ","WET UFH","YES","25 °C","Room Temp","Wired Controller"]
["FB","Heating + FCU","Fujitsu ","WET UFH","YES","26 °C","Room Temp","Wired Controller"]
["FB","Heating + FCU","Fujitsu ","WET UFH","YES","27 °C","Room Temp","Wired Controller"]
["FB","Heating + FCU","Fujitsu ","WET UFH","YES","28 °C","Room Temp","Wired Controller"]
["FB","Heating + FCU","Fujitsu ","WET UFH","YES","29 °C","Room Temp","Wired Controller"]
["FB","Heating + FCU","Fujitsu ","WET UFH","YES","30 °C","Room Temp","Wired Controller"]
["FB","Heating + FCU","Fujitsu ","WET UFH","YES","31 °C","Room Temp","Wired Controller"]
["FB","Heating + FCU","Fujitsu ","WET UFH","YES","32 °C","Room Temp","Wired Controller"]
["FB","Heating + FCU","Fujitsu ","WET UFH","YES","33 °C","Room Temp","Wired Controller"]
["FB","Heating + FCU","Fujitsu ","WET UFH","YES","34 °C","Room Temp","Wired Controller"]
["FB","Heating + FCU","Fujitsu ","WET UFH","YES","35 °C","Room Temp","Wired Controller"]
["FB","Heating + FCU","Fujitsu ","WET UFH","YES","36 °C","Room Temp","Wired Controller"]
["FB","Heating + FCU","Fujitsu ","WET UFH","YES","37 °C","Room Temp","Wired Controller"]
["FB","Heating + FCU","Fujitsu ","WET UFH","YES","38 °C","Room Temp","Wired Controller"]
["FB","Heating + FCU","Fujitsu ","WET UFH","YES","39 °C","Room Temp","Wired Controller"]
["FB","Heating + FCU","Fujitsu ","WET UFH","YES","40 °C","Room Temp","Wired Controller"]
["FB","Heating + FCU","Hitachi ","WET UFH","YES","TBA","Room Temp","Wired Controller"]
["FB","Heating + FCU","Hitachi ","WET UFH","YES","25 °C","Room Temp","Wired Controller"]
["FB","Heating + FCU","Hitachi ","WET UFH","YES","26 °C","Room Temp","Wired Controller"]
["FB","Heating + FCU","Hitachi ","WET UFH","YES","27 °C","Room Temp","Wired Controller"]
["FB","Heating + FCU","Hitachi ","WET UFH","YES","28 °C","Room Temp","Wired Controller"]
["FB","Heating + FCU","Hitachi ","WET UFH","YES","29 °C","Room Temp","Wired Controller"]
["FB","Heating + FCU","Hitachi ","WET UFH","YES","30 °C","Room Temp","Wired Controller"]
["FB","Heating + FCU","Hitachi ","WET UFH","YES","31 °C","Room Temp","Wired Controller"]
["FB","Heating + FCU","Hitachi ","WET UFH","YES","32 °C","Room Temp","Wired Controller"]
["FB","Heating + FCU","Hitachi ","WET UFH","YES","33 °C","Room Temp","Wired Controller"]
["FB","Heating + FCU","Hitachi ","WET UFH","YES","34 °C","Room Temp","Wired Controller"]
["FB","Heating + FCU","Hitachi ","WET UFH","YES","35 °C","Room Temp","Wired Controller"]
["FB","Heating + FCU","Hitachi ","WET UFH","YES","36 °C","Room Temp","Wired Controller"]
["FB","Heating + FCU","Hitachi ","WET UFH","YES","37 °C","Room Temp","Wired Controller"]
["FB","Heating + FCU","Hitachi ","WET UFH","YES","38 °C","Room Temp","Wired Controller"]
["FB","Heating + FCU","Hitachi ","WET UFH","YES","39 °C","Room Temp","Wired Controller"]
["FB","Heating + FCU","Hitachi ","WET UFH","YES","40 °C","Room Temp","Wired Controller"]
["FB","Heating + FCU","LG","WET UFH","YES","TBA","Room Temp","Wired Controller"]
["FB","Heating + FCU","LG","WET UFH","YES","25 °C","Room Temp","Wired Controller"]
["FB","Heating + FCU","LG","WET UFH","YES","26 °C","Room Temp","Wired Controller"]
["FB","Heating + FCU","LG","WET UFH","YES","27 °C","Room Temp","Wired Controller"]
["FB","Heating + FCU","LG","WET UFH","YES","28 °C","Room Temp","Wired Controller"]
["FB","Heating + FCU","LG","WET UFH","YES","29 °C","Room Temp","Wired Controller"]
["FB","Heating + FCU","LG","WET UFH","YES","30 °C","Room Temp","Wired Controller"]
["FB","Heating + FCU","LG","WET UFH","YES","31 °C","Room Temp","Wired Controller"]
["FB","Heating + FCU","LG","WET UFH","YES","32 °C","Room Temp","Wired Controller"]
["FB","Heating + FCU","LG","WET UFH","YES","33 °C","Room Temp","Wired Controller"]
["FB","Heating + FCU","LG","WET UFH","YES","34 °C","Room Temp","Wired Controller"]
["FB","Heating + FCU","LG","WET UFH","YES","35 °C","Room Temp","Wired Controller"]
["FB","Heating + FCU","LG","WET UFH","YES","36 °C","Room Temp","Wired Controller"]
["FB","Heating + FCU","LG","WET UFH","YES","37 °C","Room Temp","Wired Controller"]
["FB","Heating + FCU","LG","WET UFH","YES","38 °C","Room Temp","Wired Controller"]
["FB","Heating + FCU","LG","WET UFH","YES","39 °C","Room Temp","Wired Controller"]
["FB","Heating + FCU","LG","WET UFH","YES","40 °C","Room Temp","Wired Controller"]
["FB","Heating + FCU","Other","WET UFH","YES","TBA","Room Temp","Wired Controller"]
["FB","Heating + FCU","Other","WET UFH","YES","25 °C","Room Temp","Wired Controller"]
["FB","Heating + FCU","Other","WET UFH","YES","26 °C","Room Temp","Wired Controller"]
["FB","Heating + FCU","Other","WET UFH","YES","27 °C","Room Temp","Wired Controller"]
["FB","Heating + FCU","Other","WET UFH","YES","28 °C","Room Temp","Wired Controller"]
["FB","Heating + FCU","Other","WET UFH","YES","29 °C","Room Temp","Wired Controller"]
["FB","Heating + FCU","Other","WET UFH","YES","30 °C","Room Temp","Wired Controller"]
["FB","Heating + FCU","Other","WET UFH","YES","31 °C","Room Temp","Wired Controller"]
["FB","Heating + FCU","Other","WET UFH","YES","32 °C","Room Temp","Wired Controller"]
["FB","Heating + FCU","Other","WET UFH","YES","33 °C","Room Temp","Wired Controller"]
["FB","Heating + FCU","Other","WET UFH","YES","34 °C","Room Temp","Wired Controller"]
["FB","Heating + FCU","Other","WET UFH","YES","35 °C","Room Temp","Wired Controller"]
["FB","Heating + FCU","Other","WET UFH","YES","36 °C","Room Temp","Wired Controller"]
["FB","Heating + FCU","Other","WET UFH","YES","37 °C","Room Temp","Wired Controller"]
["FB","Heating + FCU","Other","WET UFH","YES","38 °C","Room Temp","Wired Controller"]
["FB","Heating + FCU","Other","WET UFH","YES","39 °C","Room Temp","Wired Controller"]
["FB","Heating + FCU","Other","WET UFH","YES","40 °C","Room Temp","Wired Controller"]
["FC","Heating + FCU","PLEASE SELECT","ELECTRIC UFH","NO","N/A","Room Temp","Wired Controller"]
["FC","Heating + FCU","Daikin","ELECTRIC UFH","NO","N/A","Room Temp","Wired Controller"]
["FC","Heating + FCU","Mitsubishi","ELECTRIC UFH","NO","N/A","Room Temp","Wired Controller"]
["FC","Heating + FCU","Toshiba","ELECTRIC UFH","NO","N/A","Room Temp","Wired Controller"]
["FC","Heating + FCU","Sanyo ","ELECTRIC UFH","NO","N/A","Room Temp","Wired Controller"]
["FC","Heating + FCU","Panasonic ","ELECTRIC UFH","NO","N/A","Room Temp","Wired Controller"]
["FC","Heating + FCU","Fujitsu ","ELECTRIC UFH","NO","N/A","Room Temp","Wired Controller"]
["FC","Heating + FCU","Hitachi ","ELECTRIC UFH","NO","N/A","Room Temp","Wired Controller"]
["FC","Heating + FCU","LG","ELECTRIC UFH","NO","N/A","Room Temp","Wired Controller"]
["FC","Heating + FCU","Other","ELECTRIC UFH","NO","N/A","Room Temp","Wired Controller"]
["FD","Heating + FCU","PLEASE SELECT","ELECTRIC UFH","YES","PLEASE SELECT","Room Temp","Wired Controller"]
["FD","Heating + FCU","Daikin","ELECTRIC UFH","YES","TBA","Room Temp","Wired Controller"]
["FD","Heating + FCU","Daikin","ELECTRIC UFH","YES","25 °C","Room Temp","Wired Controller"]
["FD","Heating + FCU","Daikin","ELECTRIC UFH","YES","26 °C","Room Temp","Wired Controller"]
["FD","Heating + FCU","Daikin","ELECTRIC UFH","YES","27 °C","Room Temp","Wired Controller"]
["FD","Heating + FCU","Daikin","ELECTRIC UFH","YES","28 °C","Room Temp","Wired Controller"]
["FD","Heating + FCU","Daikin","ELECTRIC UFH","YES","29 °C","Room Temp","Wired Controller"]
["FD","Heating + FCU","Daikin","ELECTRIC UFH","YES","30 °C","Room Temp","Wired Controller"]
["FD","Heating + FCU","Daikin","ELECTRIC UFH","YES","31 °C","Room Temp","Wired Controller"]
["FD","Heating + FCU","Daikin","ELECTRIC UFH","YES","32 °C","Room Temp","Wired Controller"]
["FD","Heating + FCU","Daikin","ELECTRIC UFH","YES","33 °C","Room Temp","Wired Controller"]
["FD","Heating + FCU","Daikin","ELECTRIC UFH","YES","34 °C","Room Temp","Wired Controller"]
["FD","Heating + FCU","Daikin","ELECTRIC UFH","YES","35 °C","Room Temp","Wired Controller"]
["FD","Heating + FCU","Daikin","ELECTRIC UFH","YES","36 °C","Room Temp","Wired Controller"]
["FD","Heating + FCU","Daikin","ELECTRIC UFH","YES","37 °C","Room Temp","Wired Controller"]
["FD","Heating + FCU","Daikin","ELECTRIC UFH","YES","38 °C","Room Temp","Wired Controller"]
["FD","Heating + FCU","Daikin","ELECTRIC UFH","YES","39 °C","Room Temp","Wired Controller"]
["FD","Heating + FCU","Daikin","ELECTRIC UFH","YES","40 °C","Room Temp","Wired Controller"]
["FD","Heating + FCU","Mitsubishi","ELECTRIC UFH","YES","TBA","Room Temp","Wired Controller"]
["FD","Heating + FCU","Mitsubishi","ELECTRIC UFH","YES","25 °C","Room Temp","Wired Controller"]
["FD","Heating + FCU","Mitsubishi","ELECTRIC UFH","YES","26 °C","Room Temp","Wired Controller"]
["FD","Heating + FCU","Mitsubishi","ELECTRIC UFH","YES","27 °C","Room Temp","Wired Controller"]
["FD","Heating + FCU","Mitsubishi","ELECTRIC UFH","YES","28 °C","Room Temp","Wired Controller"]
["FD","Heating + FCU","Mitsubishi","ELECTRIC UFH","YES","29 °C","Room Temp","Wired Controller"]
["FD","Heating + FCU","Mitsubishi","ELECTRIC UFH","YES","30 °C","Room Temp","Wired Controller"]
["FD","Heating + FCU","Mitsubishi","ELECTRIC UFH","YES","31 °C","Room Temp","Wired Controller"]
["FD","Heating + FCU","Mitsubishi","ELECTRIC UFH","YES","32 °C","Room Temp","Wired Controller"]
["FD","Heating + FCU","Mitsubishi","ELECTRIC UFH","YES","33 °C","Room Temp","Wired Controller"]
["FD","Heating + FCU","Mitsubishi","ELECTRIC UFH","YES","34 °C","Room Temp","Wired Controller"]
["FD","Heating + FCU","Mitsubishi","ELECTRIC UFH","YES","35 °C","Room Temp","Wired Controller"]
["FD","Heating + FCU","Mitsubishi","ELECTRIC UFH","YES","36 °C","Room Temp","Wired Controller"]
["FD","Heating + FCU","Mitsubishi","ELECTRIC UFH","YES","37 °C","Room Temp","Wired Controller"]
["FD","Heating + FCU","Mitsubishi","ELECTRIC UFH","YES","38 °C","Room Temp","Wired Controller"]
["FD","Heating + FCU","Mitsubishi","ELECTRIC UFH","YES","39 °C","Room Temp","Wired Controller"]
["FD","Heating + FCU","Mitsubishi","ELECTRIC UFH","YES","40 °C","Room Temp","Wired Controller"]
["FD","Heating + FCU","Toshiba","ELECTRIC UFH","YES","TBA","Room Temp","Wired Controller"]
["FD","Heating + FCU","Toshiba","ELECTRIC UFH","YES","25 °C","Room Temp","Wired Controller"]
["FD","Heating + FCU","Toshiba","ELECTRIC UFH","YES","26 °C","Room Temp","Wired Controller"]
["FD","Heating + FCU","Toshiba","ELECTRIC UFH","YES","27 °C","Room Temp","Wired Controller"]
["FD","Heating + FCU","Toshiba","ELECTRIC UFH","YES","28 °C","Room Temp","Wired Controller"]
["FD","Heating + FCU","Toshiba","ELECTRIC UFH","YES","29 °C","Room Temp","Wired Controller"]
["FD","Heating + FCU","Toshiba","ELECTRIC UFH","YES","30 °C","Room Temp","Wired Controller"]
["FD","Heating + FCU","Toshiba","ELECTRIC UFH","YES","31 °C","Room Temp","Wired Controller"]
["FD","Heating + FCU","Toshiba","ELECTRIC UFH","YES","32 °C","Room Temp","Wired Controller"]
["FD","Heating + FCU","Toshiba","ELECTRIC UFH","YES","33 °C","Room Temp","Wired Controller"]
["FD","Heating + FCU","Toshiba","ELECTRIC UFH","YES","34 °C","Room Temp","Wired Controller"]
["FD","Heating + FCU","Toshiba","ELECTRIC UFH","YES","35 °C","Room Temp","Wired Controller"]
["FD","Heating + FCU","Toshiba","ELECTRIC UFH","YES","36 °C","Room Temp","Wired Controller"]
["FD","Heating + FCU","Toshiba","ELECTRIC UFH","YES","37 °C","Room Temp","Wired Controller"]
["FD","Heating + FCU","Toshiba","ELECTRIC UFH","YES","38 °C","Room Temp","Wired Controller"]
["FD","Heating + FCU","Toshiba","ELECTRIC UFH","YES","39 °C","Room Temp","Wired Controller"]
["FD","Heating + FCU","Toshiba","ELECTRIC UFH","YES","40 °C","Room Temp","Wired Controller"]
["FD","Heating + FCU","Sanyo ","ELECTRIC UFH","YES","TBA","Room Temp","Wired Controller"]
["FD","Heating + FCU","Sanyo ","ELECTRIC UFH","YES","25 °C","Room Temp","Wired Controller"]
["FD","Heating + FCU","Sanyo ","ELECTRIC UFH","YES","26 °C","Room Temp","Wired Controller"]
["FD","Heating + FCU","Sanyo ","ELECTRIC UFH","YES","27 °C","Room Temp","Wired Controller"]
["FD","Heating + FCU","Sanyo ","ELECTRIC UFH","YES","28 °C","Room Temp","Wired Controller"]
["FD","Heating + FCU","Sanyo ","ELECTRIC UFH","YES","29 °C","Room Temp","Wired Controller"]
["FD","Heating + FCU","Sanyo ","ELECTRIC UFH","YES","30 °C","Room Temp","Wired Controller"]
["FD","Heating + FCU","Sanyo ","ELECTRIC UFH","YES","31 °C","Room Temp","Wired Controller"]
["FD","Heating + FCU","Sanyo ","ELECTRIC UFH","YES","32 °C","Room Temp","Wired Controller"]
["FD","Heating + FCU","Sanyo ","ELECTRIC UFH","YES","33 °C","Room Temp","Wired Controller"]
["FD","Heating + FCU","Sanyo ","ELECTRIC UFH","YES","34 °C","Room Temp","Wired Controller"]
["FD","Heating + FCU","Sanyo ","ELECTRIC UFH","YES","35 °C","Room Temp","Wired Controller"]
["FD","Heating + FCU","Sanyo ","ELECTRIC UFH","YES","36 °C","Room Temp","Wired Controller"]
["FD","Heating + FCU","Sanyo ","ELECTRIC UFH","YES","37 °C","Room Temp","Wired Controller"]
["FD","Heating + FCU","Sanyo ","ELECTRIC UFH","YES","38 °C","Room Temp","Wired Controller"]
["FD","Heating + FCU","Sanyo ","ELECTRIC UFH","YES","39 °C","Room Temp","Wired Controller"]
["FD","Heating + FCU","Sanyo ","ELECTRIC UFH","YES","40 °C","Room Temp","Wired Controller"]
["FD","Heating + FCU","Panasonic ","ELECTRIC UFH","YES","TBA","Room Temp","Wired Controller"]
["FD","Heating + FCU","Panasonic ","ELECTRIC UFH","YES","25 °C","Room Temp","Wired Controller"]
["FD","Heating + FCU","Panasonic ","ELECTRIC UFH","YES","26 °C","Room Temp","Wired Controller"]
["FD","Heating + FCU","Panasonic ","ELECTRIC UFH","YES","27 °C","Room Temp","Wired Controller"]
["FD","Heating + FCU","Panasonic ","ELECTRIC UFH","YES","28 °C","Room Temp","Wired Controller"]
["FD","Heating + FCU","Panasonic ","ELECTRIC UFH","YES","29 °C","Room Temp","Wired Controller"]
["FD","Heating + FCU","Panasonic ","ELECTRIC UFH","YES","30 °C","Room Temp","Wired Controller"]
["FD","Heating + FCU","Panasonic ","ELECTRIC UFH","YES","31 °C","Room Temp","Wired Controller"]
["FD","Heating + FCU","Panasonic ","ELECTRIC UFH","YES","32 °C","Room Temp","Wired Controller"]
["FD","Heating + FCU","Panasonic ","ELECTRIC UFH","YES","33 °C","Room Temp","Wired Controller"]
["FD","Heating + FCU","Panasonic ","ELECTRIC UFH","YES","34 °C","Room Temp","Wired Controller"]
["FD","Heating + FCU","Panasonic ","ELECTRIC UFH","YES","35 °C","Room Temp","Wired Controller"]
["FD","Heating + FCU","Panasonic ","ELECTRIC UFH","YES","36 °C","Room Temp","Wired Controller"]
["FD","Heating + FCU","Panasonic ","ELECTRIC UFH","YES","37 °C","Room Temp","Wired Controller"]
["FD","Heating + FCU","Panasonic ","ELECTRIC UFH","YES","38 °C","Room Temp","Wired Controller"]
["FD","Heating + FCU","Panasonic ","ELECTRIC UFH","YES","39 °C","Room Temp","Wired Controller"]
["FD","Heating + FCU","Panasonic ","ELECTRIC UFH","YES","40 °C","Room Temp","Wired Controller"]
["FD","Heating + FCU","Fujitsu ","ELECTRIC UFH","YES","TBA","Room Temp","Wired Controller"]
["FD","Heating + FCU","Fujitsu ","ELECTRIC UFH","YES","25 °C","Room Temp","Wired Controller"]
["FD","Heating + FCU","Fujitsu ","ELECTRIC UFH","YES","26 °C","Room Temp","Wired Controller"]
["FD","Heating + FCU","Fujitsu ","ELECTRIC UFH","YES","27 °C","Room Temp","Wired Controller"]
["FD","Heating + FCU","Fujitsu ","ELECTRIC UFH","YES","28 °C","Room Temp","Wired Controller"]
["FD","Heating + FCU","Fujitsu ","ELECTRIC UFH","YES","29 °C","Room Temp","Wired Controller"]
["FD","Heating + FCU","Fujitsu ","ELECTRIC UFH","YES","30 °C","Room Temp","Wired Controller"]
["FD","Heating + FCU","Fujitsu ","ELECTRIC UFH","YES","31 °C","Room Temp","Wired Controller"]
["FD","Heating + FCU","Fujitsu ","ELECTRIC UFH","YES","32 °C","Room Temp","Wired Controller"]
["FD","Heating + FCU","Fujitsu ","ELECTRIC UFH","YES","33 °C","Room Temp","Wired Controller"]
["FD","Heating + FCU","Fujitsu ","ELECTRIC UFH","YES","34 °C","Room Temp","Wired Controller"]
["FD","Heating + FCU","Fujitsu ","ELECTRIC UFH","YES","35 °C","Room Temp","Wired Controller"]
["FD","Heating + FCU","Fujitsu ","ELECTRIC UFH","YES","36 °C","Room Temp","Wired Controller"]
["FD","Heating + FCU","Fujitsu ","ELECTRIC UFH","YES","37 °C","Room Temp","Wired Controller"]
["FD","Heating + FCU","Fujitsu ","ELECTRIC UFH","YES","38 °C","Room Temp","Wired Controller"]
["FD","Heating + FCU","Fujitsu ","ELECTRIC UFH","YES","39 °C","Room Temp","Wired Controller"]
["FD","Heating + FCU","Fujitsu ","ELECTRIC UFH","YES","40 °C","Room Temp","Wired Controller"]
["FD","Heating + FCU","Hitachi ","ELECTRIC UFH","YES","TBA","Room Temp","Wired Controller"]
["FD","Heating + FCU","Hitachi ","ELECTRIC UFH","YES","25 °C","Room Temp","Wired Controller"]
["FD","Heating + FCU","Hitachi ","ELECTRIC UFH","YES","26 °C","Room Temp","Wired Controller"]
["FD","Heating + FCU","Hitachi ","ELECTRIC UFH","YES","27 °C","Room Temp","Wired Controller"]
["FD","Heating + FCU","Hitachi ","ELECTRIC UFH","YES","28 °C","Room Temp","Wired Controller"]
["FD","Heating + FCU","Hitachi ","ELECTRIC UFH","YES","29 °C","Room Temp","Wired Controller"]
["FD","Heating + FCU","Hitachi ","ELECTRIC UFH","YES","30 °C","Room Temp","Wired Controller"]
["FD","Heating + FCU","Hitachi ","ELECTRIC UFH","YES","31 °C","Room Temp","Wired Controller"]
["FD","Heating + FCU","Hitachi ","ELECTRIC UFH","YES","32 °C","Room Temp","Wired Controller"]
["FD","Heating + FCU","Hitachi ","ELECTRIC UFH","YES","33 °C","Room Temp","Wired Controller"]
["FD","Heating + FCU","Hitachi ","ELECTRIC UFH","YES","34 °C","Room Temp","Wired Controller"]
["FD","Heating + FCU","Hitachi ","ELECTRIC UFH","YES","35 °C","Room Temp","Wired Controller"]
["FD","Heating + FCU","Hitachi ","ELECTRIC UFH","YES","36 °C","Room Temp","Wired Controller"]
["FD","Heating + FCU","Hitachi ","ELECTRIC UFH","YES","37 °C","Room Temp","Wired Controller"]
["FD","Heating + FCU","Hitachi ","ELECTRIC UFH","YES","38 °C","Room Temp","Wired Controller"]
["FD","Heating + FCU","Hitachi ","ELECTRIC UFH","YES","39 °C","Room Temp","Wired Controller"]
["FD","Heating + FCU","Hitachi ","ELECTRIC UFH","YES","40 °C","Room Temp","Wired Controller"]
["FD","Heating + FCU","LG","ELECTRIC UFH","YES","TBA","Room Temp","Wired Controller"]
["FD","Heating + FCU","LG","ELECTRIC UFH","YES","25 °C","Room Temp","Wired Controller"]
["FD","Heating + FCU","LG","ELECTRIC UFH","YES","26 °C","Room Temp","Wired Controller"]
["FD","Heating + FCU","LG","ELECTRIC UFH","YES","27 °C","Room Temp","Wired Controller"]
["FD","Heating + FCU","LG","ELECTRIC UFH","YES","28 °C","Room Temp","Wired Controller"]
["FD","Heating + FCU","LG","ELECTRIC UFH","YES","29 °C","Room Temp","Wired Controller"]
["FD","Heating + FCU","LG","ELECTRIC UFH","YES","30 °C","Room Temp","Wired Controller"]
["FD","Heating + FCU","LG","ELECTRIC UFH","YES","31 °C","Room Temp","Wired Controller"]
["FD","Heating + FCU","LG","ELECTRIC UFH","YES","32 °C","Room Temp","Wired Controller"]
["FD","Heating + FCU","LG","ELECTRIC UFH","YES","33 °C","Room Temp","Wired Controller"]
["FD","Heating + FCU","LG","ELECTRIC UFH","YES","34 °C","Room Temp","Wired Controller"]
["FD","Heating + FCU","LG","ELECTRIC UFH","YES","35 °C","Room Temp","Wired Controller"]
["FD","Heating + FCU","LG","ELECTRIC UFH","YES","36 °C","Room Temp","Wired Controller"]
["FD","Heating + FCU","LG","ELECTRIC UFH","YES","37 °C","Room Temp","Wired Controller"]
["FD","Heating + FCU","LG","ELECTRIC UFH","YES","38 °C","Room Temp","Wired Controller"]
["FD","Heating + FCU","LG","ELECTRIC UFH","YES","39 °C","Room Temp","Wired Controller"]
["FD","Heating + FCU","LG","ELECTRIC UFH","YES","40 °C","Room Temp","Wired Controller"]
["FD","Heating + FCU","Other","ELECTRIC UFH","YES","TBA","Room Temp","Wired Controller"]
["FD","Heating + FCU","Other","ELECTRIC UFH","YES","25 °C","Room Temp","Wired Controller"]
["FD","Heating + FCU","Other","ELECTRIC UFH","YES","26 °C","Room Temp","Wired Controller"]
["FD","Heating + FCU","Other","ELECTRIC UFH","YES","27 °C","Room Temp","Wired Controller"]
["FD","Heating + FCU","Other","ELECTRIC UFH","YES","28 °C","Room Temp","Wired Controller"]
["FD","Heating + FCU","Other","ELECTRIC UFH","YES","29 °C","Room Temp","Wired Controller"]
["FD","Heating + FCU","Other","ELECTRIC UFH","YES","30 °C","Room Temp","Wired Controller"]
["FD","Heating + FCU","Other","ELECTRIC UFH","YES","31 °C","Room Temp","Wired Controller"]
["FD","Heating + FCU","Other","ELECTRIC UFH","YES","32 °C","Room Temp","Wired Controller"]
["FD","Heating + FCU","Other","ELECTRIC UFH","YES","33 °C","Room Temp","Wired Controller"]
["FD","Heating + FCU","Other","ELECTRIC UFH","YES","34 °C","Room Temp","Wired Controller"]
["FD","Heating + FCU","Other","ELECTRIC UFH","YES","35 °C","Room Temp","Wired Controller"]
["FD","Heating + FCU","Other","ELECTRIC UFH","YES","36 °C","Room Temp","Wired Controller"]
["FD","Heating + FCU","Other","ELECTRIC UFH","YES","37 °C","Room Temp","Wired Controller"]
["FD","Heating + FCU","Other","ELECTRIC UFH","YES","38 °C","Room Temp","Wired Controller"]
["FD","Heating + FCU","Other","ELECTRIC UFH","YES","39 °C","Room Temp","Wired Controller"]
["FD","Heating + FCU","Other","ELECTRIC UFH","YES","40 °C","Room Temp","Wired Controller"]
["FE","Heating + FCU","PLEASE SELECT","RADIATOR","N/A","N/A","Room Temp","Wired Controller"]
["FE","Heating + FCU","Daikin","RADIATOR","N/A","N/A","Room Temp","Wired Controller"]
["FE","Heating + FCU","Mitsubishi","RADIATOR","N/A","N/A","Room Temp","Wired Controller"]
["FE","Heating + FCU","Toshiba","RADIATOR","N/A","N/A","Room Temp","Wired Controller"]
["FE","Heating + FCU","Sanyo ","RADIATOR","N/A","N/A","Room Temp","Wired Controller"]
["FE","Heating + FCU","Panasonic ","RADIATOR","N/A","N/A","Room Temp","Wired Controller"]
["FE","Heating + FCU","Fujitsu ","RADIATOR","N/A","N/A","Room Temp","Wired Controller"]
["FE","Heating + FCU","Hitachi ","RADIATOR","N/A","N/A","Room Temp","Wired Controller"]
["FE","Heating + FCU","LG","RADIATOR","N/A","N/A","Room Temp","Wired Controller"]
["FE","Heating + FCU","Other","RADIATOR","N/A","N/A","Room Temp","Wired Controller"]
["FF","FCU Only","PLEASE SELECT","N/A","N/A","N/A","Room Temp","Wired Controller"]
["FF","FCU Only","Daikin","N/A","N/A","N/A","Room Temp","Wired Controller"]
["FF","FCU Only","Mitsubishi","N/A","N/A","N/A","Room Temp","Wired Controller"]
["FF","FCU Only","Toshiba","N/A","N/A","N/A","Room Temp","Wired Controller"]
["FF","FCU Only","Sanyo ","N/A","N/A","N/A","Room Temp","Wired Controller"]
["FF","FCU Only","Panasonic ","N/A","N/A","N/A","Room Temp","Wired Controller"]
["FF","FCU Only","Fujitsu ","N/A","N/A","N/A","Room Temp","Wired Controller"]
["FF","FCU Only","Hitachi ","N/A","N/A","N/A","Room Temp","Wired Controller"]
["FF","FCU Only","LG","N/A","N/A","N/A","Room Temp","Wired Controller"]
["FF","FCU Only","Other","N/A","N/A","N/A","Room Temp","Wired Controller"]
["FAB","Heating + FCU","PLEASE SELECT","WET UFH","NO","N/A","Room Temp","ClimateSync Room Sensor"]
["FAB","Heating + FCU","Daikin","WET UFH","NO","N/A","Room Temp","ClimateSync Room Sensor"]
["FAB","Heating + FCU","Mitsubishi","WET UFH","NO","N/A","Room Temp","ClimateSync Room Sensor"]
["FAB","Heating + FCU","Toshiba","WET UFH","NO","N/A","Room Temp","ClimateSync Room Sensor"]
["FAB","Heating + FCU","Sanyo ","WET UFH","NO","N/A","Room Temp","ClimateSync Room Sensor"]
["FAB","Heating + FCU","Panasonic ","WET UFH","NO","N/A","Room Temp","ClimateSync Room Sensor"]
["FAB","Heating + FCU","Fujitsu ","WET UFH","NO","N/A","Room Temp","ClimateSync Room Sensor"]
["FAB","Heating + FCU","Hitachi ","WET UFH","NO","N/A","Room Temp","ClimateSync Room Sensor"]
["FAB","Heating + FCU","LG","WET UFH","NO","N/A","Room Temp","ClimateSync Room Sensor"]
["FAB","Heating + FCU","Other","WET UFH","NO","N/A","Room Temp","ClimateSync Room Sensor"]
["FBB","Heating + FCU","PLEASE SELECT","WET UFH","YES","PLEASE SELECT","Room Temp","ClimateSync Room Sensor"]
["FBB","Heating + FCU","Daikin","WET UFH","YES","TBA","Room Temp","ClimateSync Room Sensor"]
["FBB","Heating + FCU","Daikin","WET UFH","YES","25 °C","Room Temp","ClimateSync Room Sensor"]
["FBB","Heating + FCU","Daikin","WET UFH","YES","26 °C","Room Temp","ClimateSync Room Sensor"]
["FBB","Heating + FCU","Daikin","WET UFH","YES","27 °C","Room Temp","ClimateSync Room Sensor"]
["FBB","Heating + FCU","Daikin","WET UFH","YES","28 °C","Room Temp","ClimateSync Room Sensor"]
["FBB","Heating + FCU","Daikin","WET UFH","YES","29 °C","Room Temp","ClimateSync Room Sensor"]
["FBB","Heating + FCU","Daikin","WET UFH","YES","30 °C","Room Temp","ClimateSync Room Sensor"]
["FBB","Heating + FCU","Daikin","WET UFH","YES","31 °C","Room Temp","ClimateSync Room Sensor"]
["FBB","Heating + FCU","Daikin","WET UFH","YES","32 °C","Room Temp","ClimateSync Room Sensor"]
["FBB","Heating + FCU","Daikin","WET UFH","YES","33 °C","Room Temp","ClimateSync Room Sensor"]
["FBB","Heating + FCU","Daikin","WET UFH","YES","34 °C","Room Temp","ClimateSync Room Sensor"]
["FBB","Heating + FCU","Daikin","WET UFH","YES","35 °C","Room Temp","ClimateSync Room Sensor"]
["FBB","Heating + FCU","Daikin","WET UFH","YES","36 °C","Room Temp","ClimateSync Room Sensor"]
["FBB","Heating + FCU","Daikin","WET UFH","YES","37 °C","Room Temp","ClimateSync Room Sensor"]
["FBB","Heating + FCU","Daikin","WET UFH","YES","38 °C","Room Temp","ClimateSync Room Sensor"]
["FBB","Heating + FCU","Daikin","WET UFH","YES","39 °C","Room Temp","ClimateSync Room Sensor"]
["FBB","Heating + FCU","Daikin","WET UFH","YES","40 °C","Room Temp","ClimateSync Room Sensor"]
["FBB","Heating + FCU","Mitsubishi","WET UFH","YES","TBA","Room Temp","ClimateSync Room Sensor"]
["FBB","Heating + FCU","Mitsubishi","WET UFH","YES","25 °C","Room Temp","ClimateSync Room Sensor"]
["FBB","Heating + FCU","Mitsubishi","WET UFH","YES","26 °C","Room Temp","ClimateSync Room Sensor"]
["FBB","Heating + FCU","Mitsubishi","WET UFH","YES","27 °C","Room Temp","ClimateSync Room Sensor"]
["FBB","Heating + FCU","Mitsubishi","WET UFH","YES","28 °C","Room Temp","ClimateSync Room Sensor"]
["FBB","Heating + FCU","Mitsubishi","WET UFH","YES","29 °C","Room Temp","ClimateSync Room Sensor"]
["FBB","Heating + FCU","Mitsubishi","WET UFH","YES","30 °C","Room Temp","ClimateSync Room Sensor"]
["FBB","Heating + FCU","Mitsubishi","WET UFH","YES","31 °C","Room Temp","ClimateSync Room Sensor"]
["FBB","Heating + FCU","Mitsubishi","WET UFH","YES","32 °C","Room Temp","ClimateSync Room Sensor"]
["FBB","Heating + FCU","Mitsubishi","WET UFH","YES","33 °C","Room Temp","ClimateSync Room Sensor"]
["FBB","Heating + FCU","Mitsubishi","WET UFH","YES","34 °C","Room Temp","ClimateSync Room Sensor"]
["FBB","Heating + FCU","Mitsubishi","WET UFH","YES","35 °C","Room Temp","ClimateSync Room Sensor"]
["FBB","Heating + FCU","Mitsubishi","WET UFH","YES","36 °C","Room Temp","ClimateSync Room Sensor"]
["FBB","Heating + FCU","Mitsubishi","WET UFH","YES","37 °C","Room Temp","ClimateSync Room Sensor"]
["FBB","Heating + FCU","Mitsubishi","WET UFH","YES","38 °C","Room Temp","ClimateSync Room Sensor"]
["FBB","Heating + FCU","Mitsubishi","WET UFH","YES","39 °C","Room Temp","ClimateSync Room Sensor"]
["FBB","Heating + FCU","Mitsubishi","WET UFH","YES","40 °C","Room Temp","ClimateSync Room Sensor"]
["FBB","Heating + FCU","Toshiba","WET UFH","YES","TBA","Room Temp","ClimateSync Room Sensor"]
["FBB","Heating + FCU","Toshiba","WET UFH","YES","25 °C","Room Temp","ClimateSync Room Sensor"]
["FBB","Heating + FCU","Toshiba","WET UFH","YES","26 °C","Room Temp","ClimateSync Room Sensor"]
["FBB","Heating + FCU","Toshiba","WET UFH","YES","27 °C","Room Temp","ClimateSync Room Sensor"]
["FBB","Heating + FCU","Toshiba","WET UFH","YES","28 °C","Room Temp","ClimateSync Room Sensor"]
["FBB","Heating + FCU","Toshiba","WET UFH","YES","29 °C","Room Temp","ClimateSync Room Sensor"]
["FBB","Heating + FCU","Toshiba","WET UFH","YES","30 °C","Room Temp","ClimateSync Room Sensor"]
["FBB","Heating + FCU","Toshiba","WET UFH","YES","31 °C","Room Temp","ClimateSync Room Sensor"]
["FBB","Heating + FCU","Toshiba","WET UFH","YES","32 °C","Room Temp","ClimateSync Room Sensor"]
["FBB","Heating + FCU","Toshiba","WET UFH","YES","33 °C","Room Temp","ClimateSync Room Sensor"]
["FBB","Heating + FCU","Toshiba","WET UFH","YES","34 °C","Room Temp","ClimateSync Room Sensor"]
["FBB","Heating + FCU","Toshiba","WET UFH","YES","35 °C","Room Temp","ClimateSync Room Sensor"]
["FBB","Heating + FCU","Toshiba","WET UFH","YES","36 °C","Room Temp","ClimateSync Room Sensor"]
["FBB","Heating + FCU","Toshiba","WET UFH","YES","37 °C","Room Temp","ClimateSync Room Sensor"]
["FBB","Heating + FCU","Toshiba","WET UFH","YES","38 °C","Room Temp","ClimateSync Room Sensor"]
["FBB","Heating + FCU","Toshiba","WET UFH","YES","39 °C","Room Temp","ClimateSync Room Sensor"]
["FBB","Heating + FCU","Toshiba","WET UFH","YES","40 °C","Room Temp","ClimateSync Room Sensor"]
["FBB","Heating + FCU","Sanyo ","WET UFH","YES","TBA","Room Temp","ClimateSync Room Sensor"]
["FBB","Heating + FCU","Sanyo ","WET UFH","YES","25 °C","Room Temp","ClimateSync Room Sensor"]
["FBB","Heating + FCU","Sanyo ","WET UFH","YES","26 °C","Room Temp","ClimateSync Room Sensor"]
["FBB","Heating + FCU","Sanyo ","WET UFH","YES","27 °C","Room Temp","ClimateSync Room Sensor"]
["FBB","Heating + FCU","Sanyo ","WET UFH","YES","28 °C","Room Temp","ClimateSync Room Sensor"]
["FBB","Heating + FCU","Sanyo ","WET UFH","YES","29 °C","Room Temp","ClimateSync Room Sensor"]
["FBB","Heating + FCU","Sanyo ","WET UFH","YES","30 °C","Room Temp","ClimateSync Room Sensor"]
["FBB","Heating + FCU","Sanyo ","WET UFH","YES","31 °C","Room Temp","ClimateSync Room Sensor"]
["FBB","Heating + FCU","Sanyo ","WET UFH","YES","32 °C","Room Temp","ClimateSync Room Sensor"]
["FBB","Heating + FCU","Sanyo ","WET UFH","YES","33 °C","Room Temp","ClimateSync Room Sensor"]
["FBB","Heating + FCU","Sanyo ","WET UFH","YES","34 °C","Room Temp","ClimateSync Room Sensor"]
["FBB","Heating + FCU","Sanyo ","WET UFH","YES","35 °C","Room Temp","ClimateSync Room Sensor"]
["FBB","Heating + FCU","Sanyo ","WET UFH","YES","36 °C","Room Temp","ClimateSync Room Sensor"]
["FBB","Heating + FCU","Sanyo ","WET UFH","YES","37 °C","Room Temp","ClimateSync Room Sensor"]
["FBB","Heating + FCU","Sanyo ","WET UFH","YES","38 °C","Room Temp","ClimateSync Room Sensor"]
["FBB","Heating + FCU","Sanyo ","WET UFH","YES","39 °C","Room Temp","ClimateSync Room Sensor"]
["FBB","Heating + FCU","Sanyo ","WET UFH","YES","40 °C","Room Temp","ClimateSync Room Sensor"]
["FBB","Heating + FCU","Panasonic ","WET UFH","YES","TBA","Room Temp","ClimateSync Room Sensor"]
["FBB","Heating + FCU","Panasonic ","WET UFH","YES","25 °C","Room Temp","ClimateSync Room Sensor"]
["FBB","Heating + FCU","Panasonic ","WET UFH","YES","26 °C","Room Temp","ClimateSync Room Sensor"]
["FBB","Heating + FCU","Panasonic ","WET UFH","YES","27 °C","Room Temp","ClimateSync Room Sensor"]
["FBB","Heating + FCU","Panasonic ","WET UFH","YES","28 °C","Room Temp","ClimateSync Room Sensor"]
["FBB","Heating + FCU","Panasonic ","WET UFH","YES","29 °C","Room Temp","ClimateSync Room Sensor"]
["FBB","Heating + FCU","Panasonic ","WET UFH","YES","30 °C","Room Temp","ClimateSync Room Sensor"]
["FBB","Heating + FCU","Panasonic ","WET UFH","YES","31 °C","Room Temp","ClimateSync Room Sensor"]
["FBB","Heating + FCU","Panasonic ","WET UFH","YES","32 °C","Room Temp","ClimateSync Room Sensor"]
["FBB","Heating + FCU","Panasonic ","WET UFH","YES","33 °C","Room Temp","ClimateSync Room Sensor"]
["FBB","Heating + FCU","Panasonic ","WET UFH","YES","34 °C","Room Temp","ClimateSync Room Sensor"]
["FBB","Heating + FCU","Panasonic ","WET UFH","YES","35 °C","Room Temp","ClimateSync Room Sensor"]
["FBB","Heating + FCU","Panasonic ","WET UFH","YES","36 °C","Room Temp","ClimateSync Room Sensor"]
["FBB","Heating + FCU","Panasonic ","WET UFH","YES","37 °C","Room Temp","ClimateSync Room Sensor"]
["FBB","Heating + FCU","Panasonic ","WET UFH","YES","38 °C","Room Temp","ClimateSync Room Sensor"]
["FBB","Heating + FCU","Panasonic ","WET UFH","YES","39 °C","Room Temp","ClimateSync Room Sensor"]
["FBB","Heating + FCU","Panasonic ","WET UFH","YES","40 °C","Room Temp","ClimateSync Room Sensor"]
["FBB","Heating + FCU","Fujitsu ","WET UFH","YES","TBA","Room Temp","ClimateSync Room Sensor"]
["FBB","Heating + FCU","Fujitsu ","WET UFH","YES","25 °C","Room Temp","ClimateSync Room Sensor"]
["FBB","Heating + FCU","Fujitsu ","WET UFH","YES","26 °C","Room Temp","ClimateSync Room Sensor"]
["FBB","Heating + FCU","Fujitsu ","WET UFH","YES","27 °C","Room Temp","ClimateSync Room Sensor"]
["FBB","Heating + FCU","Fujitsu ","WET UFH","YES","28 °C","Room Temp","ClimateSync Room Sensor"]
["FBB","Heating + FCU","Fujitsu ","WET UFH","YES","29 °C","Room Temp","ClimateSync Room Sensor"]
["FBB","Heating + FCU","Fujitsu ","WET UFH","YES","30 °C","Room Temp","ClimateSync Room Sensor"]
["FBB","Heating + FCU","Fujitsu ","WET UFH","YES","31 °C","Room Temp","ClimateSync Room Sensor"]
["FBB","Heating + FCU","Fujitsu ","WET UFH","YES","32 °C","Room Temp","ClimateSync Room Sensor"]
["FBB","Heating + FCU","Fujitsu ","WET UFH","YES","33 °C","Room Temp","ClimateSync Room Sensor"]
["FBB","Heating + FCU","Fujitsu ","WET UFH","YES","34 °C","Room Temp","ClimateSync Room Sensor"]
["FBB","Heating + FCU","Fujitsu ","WET UFH","YES","35 °C","Room Temp","ClimateSync Room Sensor"]
["FBB","Heating + FCU","Fujitsu ","WET UFH","YES","36 °C","Room Temp","ClimateSync Room Sensor"]
["FBB","Heating + FCU","Fujitsu ","WET UFH","YES","37 °C","Room Temp","ClimateSync Room Sensor"]
["FBB","Heating + FCU","Fujitsu ","WET UFH","YES","38 °C","Room Temp","ClimateSync Room Sensor"]
["FBB","Heating + FCU","Fujitsu ","WET UFH","YES","39 °C","Room Temp","ClimateSync Room Sensor"]
["FBB","Heating + FCU","Fujitsu ","WET UFH","YES","40 °C","Room Temp","ClimateSync Room Sensor"]
["FBB","Heating + FCU","Hitachi ","WET UFH","YES","TBA","Room Temp","ClimateSync Room Sensor"]
["FBB","Heating + FCU","Hitachi ","WET UFH","YES","25 °C","Room Temp","ClimateSync Room Sensor"]
["FBB","Heating + FCU","Hitachi ","WET UFH","YES","26 °C","Room Temp","ClimateSync Room Sensor"]
["FBB","Heating + FCU","Hitachi ","WET UFH","YES","27 °C","Room Temp","ClimateSync Room Sensor"]
["FBB","Heating + FCU","Hitachi ","WET UFH","YES","28 °C","Room Temp","ClimateSync Room Sensor"]
["FBB","Heating + FCU","Hitachi ","WET UFH","YES","29 °C","Room Temp","ClimateSync Room Sensor"]
["FBB","Heating + FCU","Hitachi ","WET UFH","YES","30 °C","Room Temp","ClimateSync Room Sensor"]
["FBB","Heating + FCU","Hitachi ","WET UFH","YES","31 °C","Room Temp","ClimateSync Room Sensor"]
["FBB","Heating + FCU","Hitachi ","WET UFH","YES","32 °C","Room Temp","ClimateSync Room Sensor"]
["FBB","Heating + FCU","Hitachi ","WET UFH","YES","33 °C","Room Temp","ClimateSync Room Sensor"]
["FBB","Heating + FCU","Hitachi ","WET UFH","YES","34 °C","Room Temp","ClimateSync Room Sensor"]
["FBB","Heating + FCU","Hitachi ","WET UFH","YES","35 °C","Room Temp","ClimateSync Room Sensor"]
["FBB","Heating + FCU","Hitachi ","WET UFH","YES","36 °C","Room Temp","ClimateSync Room Sensor"]
["FBB","Heating + FCU","Hitachi ","WET UFH","YES","37 °C","Room Temp","ClimateSync Room Sensor"]
["FBB","Heating + FCU","Hitachi ","WET UFH","YES","38 °C","Room Temp","ClimateSync Room Sensor"]
["FBB","Heating + FCU","Hitachi ","WET UFH","YES","39 °C","Room Temp","ClimateSync Room Sensor"]
["FBB","Heating + FCU","Hitachi ","WET UFH","YES","40 °C","Room Temp","ClimateSync Room Sensor"]
["FBB","Heating + FCU","LG","WET UFH","YES","TBA","Room Temp","ClimateSync Room Sensor"]
["FBB","Heating + FCU","LG","WET UFH","YES","25 °C","Room Temp","ClimateSync Room Sensor"]
["FBB","Heating + FCU","LG","WET UFH","YES","26 °C","Room Temp","ClimateSync Room Sensor"]
["FBB","Heating + FCU","LG","WET UFH","YES","27 °C","Room Temp","ClimateSync Room Sensor"]
["FBB","Heating + FCU","LG","WET UFH","YES","28 °C","Room Temp","ClimateSync Room Sensor"]
["FBB","Heating + FCU","LG","WET UFH","YES","29 °C","Room Temp","ClimateSync Room Sensor"]
["FBB","Heating + FCU","LG","WET UFH","YES","30 °C","Room Temp","ClimateSync Room Sensor"]
["FBB","Heating + FCU","LG","WET UFH","YES","31 °C","Room Temp","ClimateSync Room Sensor"]
["FBB","Heating + FCU","LG","WET UFH","YES","32 °C","Room Temp","ClimateSync Room Sensor"]
["FBB","Heating + FCU","LG","WET UFH","YES","33 °C","Room Temp","ClimateSync Room Sensor"]
["FBB","Heating + FCU","LG","WET UFH","YES","34 °C","Room Temp","ClimateSync Room Sensor"]
["FBB","Heating + FCU","LG","WET UFH","YES","35 °C","Room Temp","ClimateSync Room Sensor"]
["FBB","Heating + FCU","LG","WET UFH","YES","36 °C","Room Temp","ClimateSync Room Sensor"]
["FBB","Heating + FCU","LG","WET UFH","YES","37 °C","Room Temp","ClimateSync Room Sensor"]
["FBB","Heating + FCU","LG","WET UFH","YES","38 °C","Room Temp","ClimateSync Room Sensor"]
["FBB","Heating + FCU","LG","WET UFH","YES","39 °C","Room Temp","ClimateSync Room Sensor"]
["FBB","Heating + FCU","LG","WET UFH","YES","40 °C","Room Temp","ClimateSync Room Sensor"]
["FBB","Heating + FCU","Other","WET UFH","YES","TBA","Room Temp","ClimateSync Room Sensor"]
["FBB","Heating + FCU","Other","WET UFH","YES","25 °C","Room Temp","ClimateSync Room Sensor"]
["FBB","Heating + FCU","Other","WET UFH","YES","26 °C","Room Temp","ClimateSync Room Sensor"]
["FBB","Heating + FCU","Other","WET UFH","YES","27 °C","Room Temp","ClimateSync Room Sensor"]
["FBB","Heating + FCU","Other","WET UFH","YES","28 °C","Room Temp","ClimateSync Room Sensor"]
["FBB","Heating + FCU","Other","WET UFH","YES","29 °C","Room Temp","ClimateSync Room Sensor"]
["FBB","Heating + FCU","Other","WET UFH","YES","30 °C","Room Temp","ClimateSync Room Sensor"]
["FBB","Heating + FCU","Other","WET UFH","YES","31 °C","Room Temp","ClimateSync Room Sensor"]
["FBB","Heating + FCU","Other","WET UFH","YES","32 °C","Room Temp","ClimateSync Room Sensor"]
["FBB","Heating + FCU","Other","WET UFH","YES","33 °C","Room Temp","ClimateSync Room Sensor"]
["FBB","Heating + FCU","Other","WET UFH","YES","34 °C","Room Temp","ClimateSync Room Sensor"]
["FBB","Heating + FCU","Other","WET UFH","YES","35 °C","Room Temp","ClimateSync Room Sensor"]
["FBB","Heating + FCU","Other","WET UFH","YES","36 °C","Room Temp","ClimateSync Room Sensor"]
["FBB","Heating + FCU","Other","WET UFH","YES","37 °C","Room Temp","ClimateSync Room Sensor"]
["FBB","Heating + FCU","Other","WET UFH","YES","38 °C","Room Temp","ClimateSync Room Sensor"]
["FBB","Heating + FCU","Other","WET UFH","YES","39 °C","Room Temp","ClimateSync Room Sensor"]
["FBB","Heating + FCU","Other","WET UFH","YES","40 °C","Room Temp","ClimateSync Room Sensor"]
["FCB","Heating + FCU","PLEASE SELECT","ELECTRIC UFH","NO","N/A","Room Temp","ClimateSync Room Sensor"]
["FCB","Heating + FCU","Daikin","ELECTRIC UFH","NO","N/A","Room Temp","ClimateSync Room Sensor"]
["FCB","Heating + FCU","Mitsubishi","ELECTRIC UFH","NO","N/A","Room Temp","ClimateSync Room Sensor"]
["FCB","Heating + FCU","Toshiba","ELECTRIC UFH","NO","N/A","Room Temp","ClimateSync Room Sensor"]
["FCB","Heating + FCU","Sanyo ","ELECTRIC UFH","NO","N/A","Room Temp","ClimateSync Room Sensor"]
["FCB","Heating + FCU","Panasonic ","ELECTRIC UFH","NO","N/A","Room Temp","ClimateSync Room Sensor"]
["FCB","Heating + FCU","Fujitsu ","ELECTRIC UFH","NO","N/A","Room Temp","ClimateSync Room Sensor"]
["FCB","Heating + FCU","Hitachi ","ELECTRIC UFH","NO","N/A","Room Temp","ClimateSync Room Sensor"]
["FCB","Heating + FCU","LG","ELECTRIC UFH","NO","N/A","Room Temp","ClimateSync Room Sensor"]
["FCB","Heating + FCU","Other","ELECTRIC UFH","NO","N/A","Room Temp","ClimateSync Room Sensor"]
["FDB","Heating + FCU","PLEASE SELECT","ELECTRIC UFH","YES","PLEASE SELECT","Room Temp","ClimateSync Room Sensor"]
["FDB","Heating + FCU","Daikin","ELECTRIC UFH","YES","TBA","Room Temp","ClimateSync Room Sensor"]
["FDB","Heating + FCU","Daikin","ELECTRIC UFH","YES","25 °C","Room Temp","ClimateSync Room Sensor"]
["FDB","Heating + FCU","Daikin","ELECTRIC UFH","YES","26 °C","Room Temp","ClimateSync Room Sensor"]
["FDB","Heating + FCU","Daikin","ELECTRIC UFH","YES","27 °C","Room Temp","ClimateSync Room Sensor"]
["FDB","Heating + FCU","Daikin","ELECTRIC UFH","YES","28 °C","Room Temp","ClimateSync Room Sensor"]
["FDB","Heating + FCU","Daikin","ELECTRIC UFH","YES","29 °C","Room Temp","ClimateSync Room Sensor"]
["FDB","Heating + FCU","Daikin","ELECTRIC UFH","YES","30 °C","Room Temp","ClimateSync Room Sensor"]
["FDB","Heating + FCU","Daikin","ELECTRIC UFH","YES","31 °C","Room Temp","ClimateSync Room Sensor"]
["FDB","Heating + FCU","Daikin","ELECTRIC UFH","YES","32 °C","Room Temp","ClimateSync Room Sensor"]
["FDB","Heating + FCU","Daikin","ELECTRIC UFH","YES","33 °C","Room Temp","ClimateSync Room Sensor"]
["FDB","Heating + FCU","Daikin","ELECTRIC UFH","YES","34 °C","Room Temp","ClimateSync Room Sensor"]
["FDB","Heating + FCU","Daikin","ELECTRIC UFH","YES","35 °C","Room Temp","ClimateSync Room Sensor"]
["FDB","Heating + FCU","Daikin","ELECTRIC UFH","YES","36 °C","Room Temp","ClimateSync Room Sensor"]
["FDB","Heating + FCU","Daikin","ELECTRIC UFH","YES","37 °C","Room Temp","ClimateSync Room Sensor"]
["FDB","Heating + FCU","Daikin","ELECTRIC UFH","YES","38 °C","Room Temp","ClimateSync Room Sensor"]
["FDB","Heating + FCU","Daikin","ELECTRIC UFH","YES","39 °C","Room Temp","ClimateSync Room Sensor"]
["FDB","Heating + FCU","Daikin","ELECTRIC UFH","YES","40 °C","Room Temp","ClimateSync Room Sensor"]
["FDB","Heating + FCU","Mitsubishi","ELECTRIC UFH","YES","TBA","Room Temp","ClimateSync Room Sensor"]
["FDB","Heating + FCU","Mitsubishi","ELECTRIC UFH","YES","25 °C","Room Temp","ClimateSync Room Sensor"]
["FDB","Heating + FCU","Mitsubishi","ELECTRIC UFH","YES","26 °C","Room Temp","ClimateSync Room Sensor"]
["FDB","Heating + FCU","Mitsubishi","ELECTRIC UFH","YES","27 °C","Room Temp","ClimateSync Room Sensor"]
["FDB","Heating + FCU","Mitsubishi","ELECTRIC UFH","YES","28 °C","Room Temp","ClimateSync Room Sensor"]
["FDB","Heating + FCU","Mitsubishi","ELECTRIC UFH","YES","29 °C","Room Temp","ClimateSync Room Sensor"]
["FDB","Heating + FCU","Mitsubishi","ELECTRIC UFH","YES","30 °C","Room Temp","ClimateSync Room Sensor"]
["FDB","Heating + FCU","Mitsubishi","ELECTRIC UFH","YES","31 °C","Room Temp","ClimateSync Room Sensor"]
["FDB","Heating + FCU","Mitsubishi","ELECTRIC UFH","YES","32 °C","Room Temp","ClimateSync Room Sensor"]
["FDB","Heating + FCU","Mitsubishi","ELECTRIC UFH","YES","33 °C","Room Temp","ClimateSync Room Sensor"]
["FDB","Heating + FCU","Mitsubishi","ELECTRIC UFH","YES","34 °C","Room Temp","ClimateSync Room Sensor"]
["FDB","Heating + FCU","Mitsubishi","ELECTRIC UFH","YES","35 °C","Room Temp","ClimateSync Room Sensor"]
["FDB","Heating + FCU","Mitsubishi","ELECTRIC UFH","YES","36 °C","Room Temp","ClimateSync Room Sensor"]
["FDB","Heating + FCU","Mitsubishi","ELECTRIC UFH","YES","37 °C","Room Temp","ClimateSync Room Sensor"]
["FDB","Heating + FCU","Mitsubishi","ELECTRIC UFH","YES","38 °C","Room Temp","ClimateSync Room Sensor"]
["FDB","Heating + FCU","Mitsubishi","ELECTRIC UFH","YES","39 °C","Room Temp","ClimateSync Room Sensor"]
["FDB","Heating + FCU","Mitsubishi","ELECTRIC UFH","YES","40 °C","Room Temp","ClimateSync Room Sensor"]
["FDB","Heating + FCU","Toshiba","ELECTRIC UFH","YES","TBA","Room Temp","ClimateSync Room Sensor"]
["FDB","Heating + FCU","Toshiba","ELECTRIC UFH","YES","25 °C","Room Temp","ClimateSync Room Sensor"]
["FDB","Heating + FCU","Toshiba","ELECTRIC UFH","YES","26 °C","Room Temp","ClimateSync Room Sensor"]
["FDB","Heating + FCU","Toshiba","ELECTRIC UFH","YES","27 °C","Room Temp","ClimateSync Room Sensor"]
["FDB","Heating + FCU","Toshiba","ELECTRIC UFH","YES","28 °C","Room Temp","ClimateSync Room Sensor"]
["FDB","Heating + FCU","Toshiba","ELECTRIC UFH","YES","29 °C","Room Temp","ClimateSync Room Sensor"]
["FDB","Heating + FCU","Toshiba","ELECTRIC UFH","YES","30 °C","Room Temp","ClimateSync Room Sensor"]
["FDB","Heating + FCU","Toshiba","ELECTRIC UFH","YES","31 °C","Room Temp","ClimateSync Room Sensor"]
["FDB","Heating + FCU","Toshiba","ELECTRIC UFH","YES","32 °C","Room Temp","ClimateSync Room Sensor"]
["FDB","Heating + FCU","Toshiba","ELECTRIC UFH","YES","33 °C","Room Temp","ClimateSync Room Sensor"]
["FDB","Heating + FCU","Toshiba","ELECTRIC UFH","YES","34 °C","Room Temp","ClimateSync Room Sensor"]
["FDB","Heating + FCU","Toshiba","ELECTRIC UFH","YES","35 °C","Room Temp","ClimateSync Room Sensor"]
["FDB","Heating + FCU","Toshiba","ELECTRIC UFH","YES","36 °C","Room Temp","ClimateSync Room Sensor"]
["FDB","Heating + FCU","Toshiba","ELECTRIC UFH","YES","37 °C","Room Temp","ClimateSync Room Sensor"]
["FDB","Heating + FCU","Toshiba","ELECTRIC UFH","YES","38 °C","Room Temp","ClimateSync Room Sensor"]
["FDB","Heating + FCU","Toshiba","ELECTRIC UFH","YES","39 °C","Room Temp","ClimateSync Room Sensor"]
["FDB","Heating + FCU","Toshiba","ELECTRIC UFH","YES","40 °C","Room Temp","ClimateSync Room Sensor"]
["FDB","Heating + FCU","Sanyo ","ELECTRIC UFH","YES","TBA","Room Temp","ClimateSync Room Sensor"]
["FDB","Heating + FCU","Sanyo ","ELECTRIC UFH","YES","25 °C","Room Temp","ClimateSync Room Sensor"]
["FDB","Heating + FCU","Sanyo ","ELECTRIC UFH","YES","26 °C","Room Temp","ClimateSync Room Sensor"]
["FDB","Heating + FCU","Sanyo ","ELECTRIC UFH","YES","27 °C","Room Temp","ClimateSync Room Sensor"]
["FDB","Heating + FCU","Sanyo ","ELECTRIC UFH","YES","28 °C","Room Temp","ClimateSync Room Sensor"]
["FDB","Heating + FCU","Sanyo ","ELECTRIC UFH","YES","29 °C","Room Temp","ClimateSync Room Sensor"]
["FDB","Heating + FCU","Sanyo ","ELECTRIC UFH","YES","30 °C","Room Temp","ClimateSync Room Sensor"]
["FDB","Heating + FCU","Sanyo ","ELECTRIC UFH","YES","31 °C","Room Temp","ClimateSync Room Sensor"]
["FDB","Heating + FCU","Sanyo ","ELECTRIC UFH","YES","32 °C","Room Temp","ClimateSync Room Sensor"]
["FDB","Heating + FCU","Sanyo ","ELECTRIC UFH","YES","33 °C","Room Temp","ClimateSync Room Sensor"]
["FDB","Heating + FCU","Sanyo ","ELECTRIC UFH","YES","34 °C","Room Temp","ClimateSync Room Sensor"]
["FDB","Heating + FCU","Sanyo ","ELECTRIC UFH","YES","35 °C","Room Temp","ClimateSync Room Sensor"]
["FDB","Heating + FCU","Sanyo ","ELECTRIC UFH","YES","36 °C","Room Temp","ClimateSync Room Sensor"]
["FDB","Heating + FCU","Sanyo ","ELECTRIC UFH","YES","37 °C","Room Temp","ClimateSync Room Sensor"]
["FDB","Heating + FCU","Sanyo ","ELECTRIC UFH","YES","38 °C","Room Temp","ClimateSync Room Sensor"]
["FDB","Heating + FCU","Sanyo ","ELECTRIC UFH","YES","39 °C","Room Temp","ClimateSync Room Sensor"]
["FDB","Heating + FCU","Sanyo ","ELECTRIC UFH","YES","40 °C","Room Temp","ClimateSync Room Sensor"]
["FDB","Heating + FCU","Panasonic ","ELECTRIC UFH","YES","TBA","Room Temp","ClimateSync Room Sensor"]
["FDB","Heating + FCU","Panasonic ","ELECTRIC UFH","YES","25 °C","Room Temp","ClimateSync Room Sensor"]
["FDB","Heating + FCU","Panasonic ","ELECTRIC UFH","YES","26 °C","Room Temp","ClimateSync Room Sensor"]
["FDB","Heating + FCU","Panasonic ","ELECTRIC UFH","YES","27 °C","Room Temp","ClimateSync Room Sensor"]
["FDB","Heating + FCU","Panasonic ","ELECTRIC UFH","YES","28 °C","Room Temp","ClimateSync Room Sensor"]
["FDB","Heating + FCU","Panasonic ","ELECTRIC UFH","YES","29 °C","Room Temp","ClimateSync Room Sensor"]
["FDB","Heating + FCU","Panasonic ","ELECTRIC UFH","YES","30 °C","Room Temp","ClimateSync Room Sensor"]
["FDB","Heating + FCU","Panasonic ","ELECTRIC UFH","YES","31 °C","Room Temp","ClimateSync Room Sensor"]
["FDB","Heating + FCU","Panasonic ","ELECTRIC UFH","YES","32 °C","Room Temp","ClimateSync Room Sensor"]
["FDB","Heating + FCU","Panasonic ","ELECTRIC UFH","YES","33 °C","Room Temp","ClimateSync Room Sensor"]
["FDB","Heating + FCU","Panasonic ","ELECTRIC UFH","YES","34 °C","Room Temp","ClimateSync Room Sensor"]
["FDB","Heating + FCU","Panasonic ","ELECTRIC UFH","YES","35 °C","Room Temp","ClimateSync Room Sensor"]
["FDB","Heating + FCU","Panasonic ","ELECTRIC UFH","YES","36 °C","Room Temp","ClimateSync Room Sensor"]
["FDB","Heating + FCU","Panasonic ","ELECTRIC UFH","YES","37 °C","Room Temp","ClimateSync Room Sensor"]
["FDB","Heating + FCU","Panasonic ","ELECTRIC UFH","YES","38 °C","Room Temp","ClimateSync Room Sensor"]
["FDB","Heating + FCU","Panasonic ","ELECTRIC UFH","YES","39 °C","Room Temp","ClimateSync Room Sensor"]
["FDB","Heating + FCU","Panasonic ","ELECTRIC UFH","YES","40 °C","Room Temp","ClimateSync Room Sensor"]
["FDB","Heating + FCU","Fujitsu ","ELECTRIC UFH","YES","TBA","Room Temp","ClimateSync Room Sensor"]
["FDB","Heating + FCU","Fujitsu ","ELECTRIC UFH","YES","25 °C","Room Temp","ClimateSync Room Sensor"]
["FDB","Heating + FCU","Fujitsu ","ELECTRIC UFH","YES","26 °C","Room Temp","ClimateSync Room Sensor"]
["FDB","Heating + FCU","Fujitsu ","ELECTRIC UFH","YES","27 °C","Room Temp","ClimateSync Room Sensor"]
["FDB","Heating + FCU","Fujitsu ","ELECTRIC UFH","YES","28 °C","Room Temp","ClimateSync Room Sensor"]
["FDB","Heating + FCU","Fujitsu ","ELECTRIC UFH","YES","29 °C","Room Temp","ClimateSync Room Sensor"]
["FDB","Heating + FCU","Fujitsu ","ELECTRIC UFH","YES","30 °C","Room Temp","ClimateSync Room Sensor"]
["FDB","Heating + FCU","Fujitsu ","ELECTRIC UFH","YES","31 °C","Room Temp","ClimateSync Room Sensor"]
["FDB","Heating + FCU","Fujitsu ","ELECTRIC UFH","YES","32 °C","Room Temp","ClimateSync Room Sensor"]
["FDB","Heating + FCU","Fujitsu ","ELECTRIC UFH","YES","33 °C","Room Temp","ClimateSync Room Sensor"]
["FDB","Heating + FCU","Fujitsu ","ELECTRIC UFH","YES","34 °C","Room Temp","ClimateSync Room Sensor"]
["FDB","Heating + FCU","Fujitsu ","ELECTRIC UFH","YES","35 °C","Room Temp","ClimateSync Room Sensor"]
["FDB","Heating + FCU","Fujitsu ","ELECTRIC UFH","YES","36 °C","Room Temp","ClimateSync Room Sensor"]
["FDB","Heating + FCU","Fujitsu ","ELECTRIC UFH","YES","37 °C","Room Temp","ClimateSync Room Sensor"]
["FDB","Heating + FCU","Fujitsu ","ELECTRIC UFH","YES","38 °C","Room Temp","ClimateSync Room Sensor"]
["FDB","Heating + FCU","Fujitsu ","ELECTRIC UFH","YES","39 °C","Room Temp","ClimateSync Room Sensor"]
["FDB","Heating + FCU","Fujitsu ","ELECTRIC UFH","YES","40 °C","Room Temp","ClimateSync Room Sensor"]
["FDB","Heating + FCU","Hitachi ","ELECTRIC UFH","YES","TBA","Room Temp","ClimateSync Room Sensor"]
["FDB","Heating + FCU","Hitachi ","ELECTRIC UFH","YES","25 °C","Room Temp","ClimateSync Room Sensor"]
["FDB","Heating + FCU","Hitachi ","ELECTRIC UFH","YES","26 °C","Room Temp","ClimateSync Room Sensor"]
["FDB","Heating + FCU","Hitachi ","ELECTRIC UFH","YES","27 °C","Room Temp","ClimateSync Room Sensor"]
["FDB","Heating + FCU","Hitachi ","ELECTRIC UFH","YES","28 °C","Room Temp","ClimateSync Room Sensor"]
["FDB","Heating + FCU","Hitachi ","ELECTRIC UFH","YES","29 °C","Room Temp","ClimateSync Room Sensor"]
["FDB","Heating + FCU","Hitachi ","ELECTRIC UFH","YES","30 °C","Room Temp","ClimateSync Room Sensor"]
["FDB","Heating + FCU","Hitachi ","ELECTRIC UFH","YES","31 °C","Room Temp","ClimateSync Room Sensor"]
["FDB","Heating + FCU","Hitachi ","ELECTRIC UFH","YES","32 °C","Room Temp","ClimateSync Room Sensor"]
["FDB","Heating + FCU","Hitachi ","ELECTRIC UFH","YES","33 °C","Room Temp","ClimateSync Room Sensor"]
["FDB","Heating + FCU","Hitachi ","ELECTRIC UFH","YES","34 °C","Room Temp","ClimateSync Room Sensor"]
["FDB","Heating + FCU","Hitachi ","ELECTRIC UFH","YES","35 °C","Room Temp","ClimateSync Room Sensor"]
["FDB","Heating + FCU","Hitachi ","ELECTRIC UFH","YES","36 °C","Room Temp","ClimateSync Room Sensor"]
["FDB","Heating + FCU","Hitachi ","ELECTRIC UFH","YES","37 °C","Room Temp","ClimateSync Room Sensor"]
["FDB","Heating + FCU","Hitachi ","ELECTRIC UFH","YES","38 °C","Room Temp","ClimateSync Room Sensor"]
["FDB","Heating + FCU","Hitachi ","ELECTRIC UFH","YES","39 °C","Room Temp","ClimateSync Room Sensor"]
["FDB","Heating + FCU","Hitachi ","ELECTRIC UFH","YES","40 °C","Room Temp","ClimateSync Room Sensor"]
["FDB","Heating + FCU","LG","ELECTRIC UFH","YES","TBA","Room Temp","ClimateSync Room Sensor"]
["FDB","Heating + FCU","LG","ELECTRIC UFH","YES","25 °C","Room Temp","ClimateSync Room Sensor"]
["FDB","Heating + FCU","LG","ELECTRIC UFH","YES","26 °C","Room Temp","ClimateSync Room Sensor"]
["FDB","Heating + FCU","LG","ELECTRIC UFH","YES","27 °C","Room Temp","ClimateSync Room Sensor"]
["FDB","Heating + FCU","LG","ELECTRIC UFH","YES","28 °C","Room Temp","ClimateSync Room Sensor"]
["FDB","Heating + FCU","LG","ELECTRIC UFH","YES","29 °C","Room Temp","ClimateSync Room Sensor"]
["FDB","Heating + FCU","LG","ELECTRIC UFH","YES","30 °C","Room Temp","ClimateSync Room Sensor"]
["FDB","Heating + FCU","LG","ELECTRIC UFH","YES","31 °C","Room Temp","ClimateSync Room Sensor"]
["FDB","Heating + FCU","LG","ELECTRIC UFH","YES","32 °C","Room Temp","ClimateSync Room Sensor"]
["FDB","Heating + FCU","LG","ELECTRIC UFH","YES","33 °C","Room Temp","ClimateSync Room Sensor"]
["FDB","Heating + FCU","LG","ELECTRIC UFH","YES","34 °C","Room Temp","ClimateSync Room Sensor"]
["FDB","Heating + FCU","LG","ELECTRIC UFH","YES","35 °C","Room Temp","ClimateSync Room Sensor"]
["FDB","Heating + FCU","LG","ELECTRIC UFH","YES","36 °C","Room Temp","ClimateSync Room Sensor"]
["FDB","Heating + FCU","LG","ELECTRIC UFH","YES","37 °C","Room Temp","ClimateSync Room Sensor"]
["FDB","Heating + FCU","LG","ELECTRIC UFH","YES","38 °C","Room Temp","ClimateSync Room Sensor"]
["FDB","Heating + FCU","LG","ELECTRIC UFH","YES","39 °C","Room Temp","ClimateSync Room Sensor"]
["FDB","Heating + FCU","LG","ELECTRIC UFH","YES","40 °C","Room Temp","ClimateSync Room Sensor"]
["FDB","Heating + FCU","Other","ELECTRIC UFH","YES","TBA","Room Temp","ClimateSync Room Sensor"]
["FDB","Heating + FCU","Other","ELECTRIC UFH","YES","25 °C","Room Temp","ClimateSync Room Sensor"]
["FDB","Heating + FCU","Other","ELECTRIC UFH","YES","26 °C","Room Temp","ClimateSync Room Sensor"]
["FDB","Heating + FCU","Other","ELECTRIC UFH","YES","27 °C","Room Temp","ClimateSync Room Sensor"]
["FDB","Heating + FCU","Other","ELECTRIC UFH","YES","28 °C","Room Temp","ClimateSync Room Sensor"]
["FDB","Heating + FCU","Other","ELECTRIC UFH","YES","29 °C","Room Temp","ClimateSync Room Sensor"]
["FDB","Heating + FCU","Other","ELECTRIC UFH","YES","30 °C","Room Temp","ClimateSync Room Sensor"]
["FDB","Heating + FCU","Other","ELECTRIC UFH","YES","31 °C","Room Temp","ClimateSync Room Sensor"]
["FDB","Heating + FCU","Other","ELECTRIC UFH","YES","32 °C","Room Temp","ClimateSync Room Sensor"]
["FDB","Heating + FCU","Other","ELECTRIC UFH","YES","33 °C","Room Temp","ClimateSync Room Sensor"]
["FDB","Heating + FCU","Other","ELECTRIC UFH","YES","34 °C","Room Temp","ClimateSync Room Sensor"]
["FDB","Heating + FCU","Other","ELECTRIC UFH","YES","35 °C","Room Temp","ClimateSync Room Sensor"]
["FDB","Heating + FCU","Other","ELECTRIC UFH","YES","36 °C","Room Temp","ClimateSync Room Sensor"]
["FDB","Heating + FCU","Other","ELECTRIC UFH","YES","37 °C","Room Temp","ClimateSync Room Sensor"]
["FDB","Heating + FCU","Other","ELECTRIC UFH","YES","38 °C","Room Temp","ClimateSync Room Sensor"]
["FDB","Heating + FCU","Other","ELECTRIC UFH","YES","39 °C","Room Temp","ClimateSync Room Sensor"]
["FDB","Heating + FCU","Other","ELECTRIC UFH","YES","40 °C","Room Temp","ClimateSync Room Sensor"]
["FEB","Heating + FCU","PLEASE SELECT","RADIATOR","N/A","N/A","Room Temp","ClimateSync Room Sensor"]
["FEB","Heating + FCU","Daikin","RADIATOR","N/A","N/A","Room Temp","ClimateSync Room Sensor"]
["FEB","Heating + FCU","Mitsubishi","RADIATOR","N/A","N/A","Room Temp","ClimateSync Room Sensor"]
["FEB","Heating + FCU","Toshiba","RADIATOR","N/A","N/A","Room Temp","ClimateSync Room Sensor"]
["FEB","Heating + FCU","Sanyo ","RADIATOR","N/A","N/A","Room Temp","ClimateSync Room Sensor"]
["FEB","Heating + FCU","Panasonic ","RADIATOR","N/A","N/A","Room Temp","ClimateSync Room Sensor"]
["FEB","Heating + FCU","Fujitsu ","RADIATOR","N/A","N/A","Room Temp","ClimateSync Room Sensor"]
["FEB","Heating + FCU","Hitachi ","RADIATOR","N/A","N/A","Room Temp","ClimateSync Room Sensor"]
["FEB","Heating + FCU","LG","RADIATOR","N/A","N/A","Room Temp","ClimateSync Room Sensor"]
["FEB","Heating + FCU","Other","RADIATOR","N/A","N/A","Room Temp","ClimateSync Room Sensor"]
["FFB","FCU Only","PLEASE SELECT","N/A","N/A","N/A","Room Temp","ClimateSync Room Sensor"]
["FFB","FCU Only","Daikin","N/A","N/A","N/A","Room Temp","ClimateSync Room Sensor"]
["FFB","FCU Only","Mitsubishi","N/A","N/A","N/A","Room Temp","ClimateSync Room Sensor"]
["FFB","FCU Only","Toshiba","N/A","N/A","N/A","Room Temp","ClimateSync Room Sensor"]
["FFB","FCU Only","Sanyo ","N/A","N/A","N/A","Room Temp","ClimateSync Room Sensor"]
["FFB","FCU Only","Panasonic ","N/A","N/A","N/A","Room Temp","ClimateSync Room Sensor"]
["FFB","FCU Only","Fujitsu ","N/A","N/A","N/A","Room Temp","ClimateSync Room Sensor"]
["FFB","FCU Only","Hitachi ","N/A","N/A","N/A","Room Temp","ClimateSync Room Sensor"]
["FFB","FCU Only","LG","N/A","N/A","N/A","Room Temp","ClimateSync Room Sensor"]
["FFB","FCU Only","Other","N/A","N/A","N/A","Room Temp","ClimateSync Room Sensor"]

{"sheet":"CombiTable","index":3,"n_rows":1826,"n_cols":17,"rows_kept":1826,"hidden":true}
["Zone Application Type","Zone Type","AC/FCU Brand","UFH Type","Floor Temperature Protection Limit Required","Floor Temperature Limit °C","Temperature to be Controlled","Zone Temp Sensor",null,"Zone Application Type","Zone Type","AC/FCU Brand","UFH Type","Floor Temperature Protection Limit Required","Floor Temperature Limit °C","Temperature to be Controlled","Zone Temp Sensor"]
["PLEASE SELECT","First Select Zone Application Type","First Select Zone Application Type","First Select Zone Application Type","First Select Zone Application Type","First Select Zone Application Type","First Select Zone Application Type","First Select Zone Application Type",null,{"$f":"_xlfn.UNIQUE(ct_01[Zone Application Type])","v":"PLEASE SELECT"},{"$f":"_xlfn.UNIQUE(ct_01[Zone Type])","v":"First Select Zone Application Type"},{"$f":"_xlfn.UNIQUE(ct_01[AC/FCU Brand])","v":"First Select Zone Application Type"},{"$f":"_xlfn.UNIQUE(ct_01[UFH Type])","v":"First Select Zone Application Type"},{"$f":"_xlfn.UNIQUE(ct_01[Floor Temperature Protection Limit Required])","v":"First Select Zone Application Type"},{"$f":"_xlfn.UNIQUE(ct_01[Floor Temperature Limit °C])","v":"First Select Zone Application Type"},{"$f":"_xlfn.UNIQUE(ct_01[Temperature to be Controlled])","v":"First Select Zone Application Type"},{"$f":"_xlfn.UNIQUE(ct_01[Zone Temp Sensor])","v":"First Select Zone Application Type"}]
["A","Heating + Air Con","PLEASE SELECT","WET UFH","NO","N/A","Room Temp","PLEASE SELECT",null,"A","Heating + Air Con","PLEASE SELECT","WET UFH","NO","N/A","Room Temp","PLEASE SELECT"]
["B","Heating + Air Con","PLEASE SELECT","WET UFH","YES","PLEASE SELECT","Room Temp","PLEASE SELECT",null,"B","AC only","N/A","ELECTRIC UFH","YES","PLEASE SELECT","Floor Temp","Floor Probe"]
["C","Heating + Air Con","PLEASE SELECT","ELECTRIC UFH","NO","N/A","Room Temp","PLEASE SELECT",null,"C","Heating","Daikin","RADIATOR","N/A","TBA","ON/OFF Only","N/A"]
["D","Heating + Air Con","PLEASE SELECT","ELECTRIC UFH","YES","PLEASE SELECT","Room Temp","PLEASE SELECT",null,"D","ON/OFF SWITCH","Mitsubishi","N/A",null,"25 °C","Cylinder Temp","Cylinder Probe"]
["E","Heating + Air Con","PLEASE SELECT","RADIATOR","N/A","N/A","Room Temp","PLEASE SELECT",null,"E","Towel Rad ON/OFF Only","Toshiba",null,null,"26 °C",null,"Room Thimble Sensor"]
["F","AC only","PLEASE SELECT","N/A","N/A","N/A","Room Temp","PLEASE SELECT",null,"F","Towel Rad Temp Control","Sanyo ",null,null,"27 °C",null,"AC Unit"]
["G","Heating","N/A","WET UFH","NO","N/A","Room Temp","PLEASE SELECT",null,"G","Hot Water ON/OFF","Panasonic ",null,null,"28 °C",null,"Wired Controller"]
["H","Heating","N/A","WET UFH","YES","PLEASE SELECT","Room Temp","PLEASE SELECT",null,"H","Hot Water, Temp Control (Valve Only)","Fujitsu ",null,null,"29 °C",null,"ClimateSync Room Sensor"]
["I","Heating","N/A","WET UFH","NO","N/A","Floor Temp","Floor Probe",null,"I","Hot Water, Temp Control (Valve & Boiler)","Hitachi ",null,null,"30 °C"]
["J","Heating","N/A","ELECTRIC UFH","NO","N/A","Room Temp","PLEASE SELECT",null,"J","Heating + FCU","LG",null,null,"31 °C"]
["K","Heating","N/A","ELECTRIC UFH","YES","PLEASE SELECT","Room Temp","PLEASE SELECT",null,"K","FCU Only","Other",null,null,"32 °C"]
["L","Heating","N/A","ELECTRIC UFH","NO","N/A","Floor Temp","Floor Probe",null,"L",{"$nulls":4},"33 °C"]
["M","Heating","N/A","RADIATOR","N/A","N/A","Room Temp","PLEASE SELECT",null,"M",{"$nulls":4},"34 °C"]
["N","ON/OFF SWITCH","N/A","N/A","N/A","N/A","ON/OFF Only","N/A",null,"N",{"$nulls":4},"35 °C"]
["O","Towel Rad ON/OFF Only","N/A","N/A","N/A","N/A","ON/OFF Only","N/A",null,"O",{"$nulls":4},"36 °C"]
["P","Towel Rad Temp Control","N/A","RADIATOR","N/A","N/A","Room Temp","PLEASE SELECT",null,"P",{"$nulls":4},"37 °C"]
["Q","Hot Water ON/OFF","N/A","N/A","N/A","N/A","ON/OFF Only","N/A",null,"Q",{"$nulls":4},"38 °C"]
["R","Hot Water, Temp Control (Valve Only)","N/A","N/A","N/A","N/A","Cylinder Temp","Cylinder Probe",null,"R",{"$nulls":4},"39 °C"]
["S","Hot Water, Temp Control (Valve & Boiler)","N/A","N/A","N/A","N/A","Cylinder Temp","Cylinder Probe",null,"S",{"$nulls":4},"40 °C"]
["A","Heating + Air Con","Daikin","WET UFH","NO","N/A","Room Temp","Room Thimble Sensor",null,"FA"]
["A","Heating + Air Con","Daikin","WET UFH","NO","N/A","Room Temp","AC Unit",null,"FB"]
["A","Heating + Air Con","Daikin","WET UFH","NO","N/A","Room Temp","Wired Controller",null,"FC"]
["B","Heating + Air Con","Daikin","WET UFH","YES","TBA","Room Temp","Room Thimble Sensor",null,"FD"]
["B","Heating + Air Con","Daikin","WET UFH","YES","TBA","Room Temp","AC Unit",null,"FE"]
["B","Heating + Air Con","Daikin","WET UFH","YES","TBA","Room Temp","Wired Controller",null,"FF"]
["B","Heating + Air Con","Daikin","WET UFH","YES","25 °C","Room Temp","Room Thimble Sensor",null,"FAB"]
["B","Heating + Air Con","Daikin","WET UFH","YES","25 °C","Room Temp","AC Unit",null,"FBB"]
["B","Heating + Air Con","Daikin","WET UFH","YES","25 °C","Room Temp","Wired Controller",null,"FCB"]
["B","Heating + Air Con","Daikin","WET UFH","YES","26 °C","Room Temp","Room Thimble Sensor",null,"FDB"]
["B","Heating + Air Con","Daikin","WET UFH","YES","26 °C","Room Temp","AC Unit",null,"FEB"]
["B","Heating + Air Con","Daikin","WET UFH","YES","26 °C","Room Temp","Wired Controller",null,"FFB"]
["B","Heating + Air Con","Daikin","WET UFH","YES","27 °C","Room Temp","Room Thimble Sensor"]
["B","Heating + Air Con","Daikin","WET UFH","YES","27 °C","Room Temp","AC Unit"]
["B","Heating + Air Con","Daikin","WET UFH","YES","27 °C","Room Temp","Wired Controller"]
["B","Heating + Air Con","Daikin","WET UFH","YES","28 °C","Room Temp","Room Thimble Sensor"]
["B","Heating + Air Con","Daikin","WET UFH","YES","28 °C","Room Temp","AC Unit"]
["B","Heating + Air Con","Daikin","WET UFH","YES","28 °C","Room Temp","Wired Controller"]
["B","Heating + Air Con","Daikin","WET UFH","YES","29 °C","Room Temp","Room Thimble Sensor"]
["B","Heating + Air Con","Daikin","WET UFH","YES","29 °C","Room Temp","AC Unit"]
["B","Heating + Air Con","Daikin","WET UFH","YES","29 °C","Room Temp","Wired Controller"]
["B","Heating + Air Con","Daikin","WET UFH","YES","30 °C","Room Temp","Room Thimble Sensor"]
["B","Heating + Air Con","Daikin","WET UFH","YES","30 °C","Room Temp","AC Unit"]
["B","Heating + Air Con","Daikin","WET UFH","YES","30 °C","Room Temp","Wired Controller"]
["B","Heating + Air Con","Daikin","WET UFH","YES","31 °C","Room Temp","Room Thimble Sensor"]
["B","Heating + Air Con","Daikin","WET UFH","YES","31 °C","Room Temp","AC Unit"]
["B","Heating + Air Con","Daikin","WET UFH","YES","31 °C","Room Temp","Wired Controller"]
["B","Heating + Air Con","Daikin","WET UFH","YES","32 °C","Room Temp","Room Thimble Sensor"]
["B","Heating + Air Con","Daikin","WET UFH","YES","32 °C","Room Temp","AC Unit"]
["B","Heating + Air Con","Daikin","WET UFH","YES","32 °C","Room Temp","Wired Controller"]
["B","Heating + Air Con","Daikin","WET UFH","YES","33 °C","Room Temp","Room Thimble Sensor"]
["B","Heating + Air Con","Daikin","WET UFH","YES","33 °C","Room Temp","AC Unit"]
["B","Heating + Air Con","Daikin","WET UFH","YES","33 °C","Room Temp","Wired Controller"]
["B","Heating + Air Con","Daikin","WET UFH","YES","34 °C","Room Temp","Room Thimble Sensor"]
["B","Heating + Air Con","Daikin","WET UFH","YES","34 °C","Room Temp","AC Unit"]
["B","Heating + Air Con","Daikin","WET UFH","YES","34 °C","Room Temp","Wired Controller"]
["B","Heating + Air Con","Daikin","WET UFH","YES","35 °C","Room Temp","Room Thimble Sensor"]
["B","Heating + Air Con","Daikin","WET UFH","YES","35 °C","Room Temp","AC Unit"]
["B","Heating + Air Con","Daikin","WET UFH","YES","35 °C","Room Temp","Wired Controller"]
["B","Heating + Air Con","Daikin","WET UFH","YES","36 °C","Room Temp","Room Thimble Sensor"]
["B","Heating + Air Con","Daikin","WET UFH","YES","36 °C","Room Temp","AC Unit"]
["B","Heating + Air Con","Daikin","WET UFH","YES","36 °C","Room Temp","Wired Controller"]
["B","Heating + Air Con","Daikin","WET UFH","YES","37 °C","Room Temp","Room Thimble Sensor"]
["B","Heating + Air Con","Daikin","WET UFH","YES","37 °C","Room Temp","AC Unit"]
["B","Heating + Air Con","Daikin","WET UFH","YES","37 °C","Room Temp","Wired Controller"]
["B","Heating + Air Con","Daikin","WET UFH","YES","38 °C","Room Temp","Room Thimble Sensor"]
["B","Heating + Air Con","Daikin","WET UFH","YES","38 °C","Room Temp","AC Unit"]
["B","Heating + Air Con","Daikin","WET UFH","YES","38 °C","Room Temp","Wired Controller"]
["B","Heating + Air Con","Daikin","WET UFH","YES","39 °C","Room Temp","Room Thimble Sensor"]
["B","Heating + Air Con","Daikin","WET UFH","YES","39 °C","Room Temp","AC Unit"]
["B","Heating + Air Con","Daikin","WET UFH","YES","39 °C","Room Temp","Wired Controller"]
["B","Heating + Air Con","Daikin","WET UFH","YES","40 °C","Room Temp","Room Thimble Sensor"]
["B","Heating + Air Con","Daikin","WET UFH","YES","40 °C","Room Temp","AC Unit"]
["B","Heating + Air Con","Daikin","WET UFH","YES","40 °C","Room Temp","Wired Controller"]
["C","Heating + Air Con","Daikin","ELECTRIC UFH","NO","N/A","Room Temp","Room Thimble Sensor"]
["C","Heating + Air Con","Daikin","ELECTRIC UFH","NO","N/A","Room Temp","AC Unit"]
["C","Heating + Air Con","Daikin","ELECTRIC UFH","NO","N/A","Room Temp","Wired Controller"]
["D","Heating + Air Con","Daikin","ELECTRIC UFH","YES","TBA","Room Temp","Room Thimble Sensor"]
["D","Heating + Air Con","Daikin","ELECTRIC UFH","YES","TBA","Room Temp","AC Unit"]
["D","Heating + Air Con","Daikin","ELECTRIC UFH","YES","TBA","Room Temp","Wired Controller"]
["D","Heating + Air Con","Daikin","ELECTRIC UFH","YES","25 °C","Room Temp","Room Thimble Sensor"]
["D","Heating + Air Con","Daikin","ELECTRIC UFH","YES","25 °C","Room Temp","AC Unit"]
["D","Heating + Air Con","Daikin","ELECTRIC UFH","YES","25 °C","Room Temp","Wired Controller"]
["D","Heating + Air Con","Daikin","ELECTRIC UFH","YES","26 °C","Room Temp","Room Thimble Sensor"]
["D","Heating + Air Con","Daikin","ELECTRIC UFH","YES","26 °C","Room Temp","AC Unit"]
["D","Heating + Air Con","Daikin","ELECTRIC UFH","YES","26 °C","Room Temp","Wired Controller"]
["D","Heating + Air Con","Daikin","ELECTRIC UFH","YES","27 °C","Room Temp","Room Thimble Sensor"]
["D","Heating + Air Con","Daikin","ELECTRIC UFH","YES","27 °C","Room Temp","AC Unit"]
["D","Heating + Air Con","Daikin","ELECTRIC UFH","YES","27 °C","Room Temp","Wired Controller"]
["D","Heating + Air Con","Daikin","ELECTRIC UFH","YES","28 °C","Room Temp","Room Thimble Sensor"]
["D","Heating + Air Con","Daikin","ELECTRIC UFH","YES","28 °C","Room Temp","AC Unit"]
["D","Heating + Air Con","Daikin","ELECTRIC UFH","YES","28 °C","Room Temp","Wired Controller"]
["D","Heating + Air Con","Daikin","ELECTRIC UFH","YES","29 °C","Room Temp","Room Thimble Sensor"]
["D","Heating + Air Con","Daikin","ELECTRIC UFH","YES","29 °C","Room Temp","AC Unit"]
["D","Heating + Air Con","Daikin","ELECTRIC UFH","YES","29 °C","Room Temp","Wired Controller"]
["D","Heating + Air Con","Daikin","ELECTRIC UFH","YES","30 °C","Room Temp","Room Thimble Sensor"]
["D","Heating + Air Con","Daikin","ELECTRIC UFH","YES","30 °C","Room Temp","AC Unit"]
["D","Heating + Air Con","Daikin","ELECTRIC UFH","YES","30 °C","Room Temp","Wired Controller"]
["D","Heating + Air Con","Daikin","ELECTRIC UFH","YES","31 °C","Room Temp","Room Thimble Sensor"]
["D","Heating + Air Con","Daikin","ELECTRIC UFH","YES","31 °C","Room Temp","AC Unit"]
["D","Heating + Air Con","Daikin","ELECTRIC UFH","YES","31 °C","Room Temp","Wired Controller"]
["D","Heating + Air Con","Daikin","ELECTRIC UFH","YES","32 °C","Room Temp","Room Thimble Sensor"]
["D","Heating + Air Con","Daikin","ELECTRIC UFH","YES","32 °C","Room Temp","AC Unit"]
["D","Heating + Air Con","Daikin","ELECTRIC UFH","YES","32 °C","Room Temp","Wired Controller"]
["D","Heating + Air Con","Daikin","ELECTRIC UFH","YES","33 °C","Room Temp","Room Thimble Sensor"]
["D","Heating + Air Con","Daikin","ELECTRIC UFH","YES","33 °C","Room Temp","AC Unit"]
["D","Heating + Air Con","Daikin","ELECTRIC UFH","YES","33 °C","Room Temp","Wired Controller"]
["D","Heating + Air Con","Daikin","ELECTRIC UFH","YES","34 °C","Room Temp","Room Thimble Sensor"]
["D","Heating + Air Con","Daikin","ELECTRIC UFH","YES","34 °C","Room Temp","AC Unit"]
["D","Heating + Air Con","Daikin","ELECTRIC UFH","YES","34 °C","Room Temp","Wired Controller"]
["D","Heating + Air Con","Daikin","ELECTRIC UFH","YES","35 °C","Room Temp","Room Thimble Sensor"]
["D","Heating + Air Con","Daikin","ELECTRIC UFH","YES","35 °C","Room Temp","AC Unit"]
["D","Heating + Air Con","Daikin","ELECTRIC UFH","YES","35 °C","Room Temp","Wired Controller"]
["D","Heating + Air Con","Daikin","ELECTRIC UFH","YES","36 °C","Room Temp","Room Thimble Sensor"]
["D","Heating + Air Con","Daikin","ELECTRIC UFH","YES","36 °C","Room Temp","AC Unit"]
["D","Heating + Air Con","Daikin","ELECTRIC UFH","YES","36 °C","Room Temp","Wired Controller"]
["D","Heating + Air Con","Daikin","ELECTRIC UFH","YES","37 °C","Room Temp","Room Thimble Sensor"]
["D","Heating + Air Con","Daikin","ELECTRIC UFH","YES","37 °C","Room Temp","AC Unit"]
["D","Heating + Air Con","Daikin","ELECTRIC UFH","YES","37 °C","Room Temp","Wired Controller"]
["D","Heating + Air Con","Daikin","ELECTRIC UFH","YES","38 °C","Room Temp","Room Thimble Sensor"]
["D","Heating + Air Con","Daikin","ELECTRIC UFH","YES","38 °C","Room Temp","AC Unit"]
["D","Heating + Air Con","Daikin","ELECTRIC UFH","YES","38 °C","Room Temp","Wired Controller"]
["D","Heating + Air Con","Daikin","ELECTRIC UFH","YES","39 °C","Room Temp","Room Thimble Sensor"]
["D","Heating + Air Con","Daikin","ELECTRIC UFH","YES","39 °C","Room Temp","AC Unit"]
["D","Heating + Air Con","Daikin","ELECTRIC UFH","YES","39 °C","Room Temp","Wired Controller"]
["D","Heating + Air Con","Daikin","ELECTRIC UFH","YES","40 °C","Room Temp","Room Thimble Sensor"]
["D","Heating + Air Con","Daikin","ELECTRIC UFH","YES","40 °C","Room Temp","AC Unit"]
["D","Heating + Air Con","Daikin","ELECTRIC UFH","YES","40 °C","Room Temp","Wired Controller"]
["E","Heating + Air Con","Daikin","RADIATOR","N/A","N/A","Room Temp","Room Thimble Sensor"]
["E","Heating + Air Con","Daikin","RADIATOR","N/A","N/A","Room Temp","AC Unit"]
["E","Heating + Air Con","Daikin","RADIATOR","N/A","N/A","Room Temp","Wired Controller"]
["A","Heating + Air Con","Mitsubishi","WET UFH","NO","N/A","Room Temp","Room Thimble Sensor"]
["A","Heating + Air Con","Mitsubishi","WET UFH","NO","N/A","Room Temp","AC Unit"]
["A","Heating + Air Con","Mitsubishi","WET UFH","NO","N/A","Room Temp","Wired Controller"]
["B","Heating + Air Con","Mitsubishi","WET UFH","YES","TBA","Room Temp","Room Thimble Sensor"]
["B","Heating + Air Con","Mitsubishi","WET UFH","YES","TBA","Room Temp","AC Unit"]
["B","Heating + Air Con","Mitsubishi","WET UFH","YES","TBA","Room Temp","Wired Controller"]
["B","Heating + Air Con","Mitsubishi","WET UFH","YES","25 °C","Room Temp","Room Thimble Sensor"]
["B","Heating + Air Con","Mitsubishi","WET UFH","YES","25 °C","Room Temp","AC Unit"]
["B","Heating + Air Con","Mitsubishi","WET UFH","YES","25 °C","Room Temp","Wired Controller"]
["B","Heating + Air Con","Mitsubishi","WET UFH","YES","26 °C","Room Temp","Room Thimble Sensor"]
["B","Heating + Air Con","Mitsubishi","WET UFH","YES","26 °C","Room Temp","AC Unit"]
["B","Heating + Air Con","Mitsubishi","WET UFH","YES","26 °C","Room Temp","Wired Controller"]
["B","Heating + Air Con","Mitsubishi","WET UFH","YES","27 °C","Room Temp","Room Thimble Sensor"]
["B","Heating + Air Con","Mitsubishi","WET UFH","YES","27 °C","Room Temp","AC Unit"]
["B","Heating + Air Con","Mitsubishi","WET UFH","YES","27 °C","Room Temp","Wired Controller"]
["B","Heating + Air Con","Mitsubishi","WET UFH","YES","28 °C","Room Temp","Room Thimble Sensor"]
["B","Heating + Air Con","Mitsubishi","WET UFH","YES","28 °C","Room Temp","AC Unit"]
["B","Heating + Air Con","Mitsubishi","WET UFH","YES","28 °C","Room Temp","Wired Controller"]
["B","Heating + Air Con","Mitsubishi","WET UFH","YES","29 °C","Room Temp","Room Thimble Sensor"]
["B","Heating + Air Con","Mitsubishi","WET UFH","YES","29 °C","Room Temp","AC Unit"]
["B","Heating + Air Con","Mitsubishi","WET UFH","YES","29 °C","Room Temp","Wired Controller"]
["B","Heating + Air Con","Mitsubishi","WET UFH","YES","30 °C","Room Temp","Room Thimble Sensor"]
["B","Heating + Air Con","Mitsubishi","WET UFH","YES","30 °C","Room Temp","AC Unit"]
["B","Heating + Air Con","Mitsubishi","WET UFH","YES","30 °C","Room Temp","Wired Controller"]
["B","Heating + Air Con","Mitsubishi","WET UFH","YES","31 °C","Room Temp","Room Thimble Sensor"]
["B","Heating + Air Con","Mitsubishi","WET UFH","YES","31 °C","Room Temp","AC Unit"]
["B","Heating + Air Con","Mitsubishi","WET UFH","YES","31 °C","Room Temp","Wired Controller"]
["B","Heating + Air Con","Mitsubishi","WET UFH","YES","32 °C","Room Temp","Room Thimble Sensor"]
["B","Heating + Air Con","Mitsubishi","WET UFH","YES","32 °C","Room Temp","AC Unit"]
["B","Heating + Air Con","Mitsubishi","WET UFH","YES","32 °C","Room Temp","Wired Controller"]
["B","Heating + Air Con","Mitsubishi","WET UFH","YES","33 °C","Room Temp","Room Thimble Sensor"]
["B","Heating + Air Con","Mitsubishi","WET UFH","YES","33 °C","Room Temp","AC Unit"]
["B","Heating + Air Con","Mitsubishi","WET UFH","YES","33 °C","Room Temp","Wired Controller"]
["B","Heating + Air Con","Mitsubishi","WET UFH","YES","34 °C","Room Temp","Room Thimble Sensor"]
["B","Heating + Air Con","Mitsubishi","WET UFH","YES","34 °C","Room Temp","AC Unit"]
["B","Heating + Air Con","Mitsubishi","WET UFH","YES","34 °C","Room Temp","Wired Controller"]
["B","Heating + Air Con","Mitsubishi","WET UFH","YES","35 °C","Room Temp","Room Thimble Sensor"]
["B","Heating + Air Con","Mitsubishi","WET UFH","YES","35 °C","Room Temp","AC Unit"]
["B","Heating + Air Con","Mitsubishi","WET UFH","YES","35 °C","Room Temp","Wired Controller"]
["B","Heating + Air Con","Mitsubishi","WET UFH","YES","36 °C","Room Temp","Room Thimble Sensor"]
["B","Heating + Air Con","Mitsubishi","WET UFH","YES","36 °C","Room Temp","AC Unit"]
["B","Heating + Air Con","Mitsubishi","WET UFH","YES","36 °C","Room Temp","Wired Controller"]
["B","Heating + Air Con","Mitsubishi","WET UFH","YES","37 °C","Room Temp","Room Thimble Sensor"]
["B","Heating + Air Con","Mitsubishi","WET UFH","YES","37 °C","Room Temp","AC Unit"]
["B","Heating + Air Con","Mitsubishi","WET UFH","YES","37 °C","Room Temp","Wired Controller"]
["B","Heating + Air Con","Mitsubishi","WET UFH","YES","38 °C","Room Temp","Room Thimble Sensor"]
["B","Heating + Air Con","Mitsubishi","WET UFH","YES","38 °C","Room Temp","AC Unit"]
["B","Heating + Air Con","Mitsubishi","WET UFH","YES","38 °C","Room Temp","Wired Controller"]
["B","Heating + Air Con","Mitsubishi","WET UFH","YES","39 °C","Room Temp","Room Thimble Sensor"]
["B","Heating + Air Con","Mitsubishi","WET UFH","YES","39 °C","Room Temp","AC Unit"]
["B","Heating + Air Con","Mitsubishi","WET UFH","YES","39 °C","Room Temp","Wired Controller"]
["B","Heating + Air Con","Mitsubishi","WET UFH","YES","40 °C","Room Temp","Room Thimble Sensor"]
["B","Heating + Air Con","Mitsubishi","WET UFH","YES","40 °C","Room Temp","AC Unit"]
["B","Heating + Air Con","Mitsubishi","WET UFH","YES","40 °C","Room Temp","Wired Controller"]
["C","Heating + Air Con","Mitsubishi","ELECTRIC UFH","NO","N/A","Room Temp","Room Thimble Sensor"]
["C","Heating + Air Con","Mitsubishi","ELECTRIC UFH","NO","N/A","Room Temp","AC Unit"]
["C","Heating + Air Con","Mitsubishi","ELECTRIC UFH","NO","N/A","Room Temp","Wired Controller"]
["D","Heating + Air Con","Mitsubishi","ELECTRIC UFH","YES","TBA","Room Temp","Room Thimble Sensor"]
["D","Heating + Air Con","Mitsubishi","ELECTRIC UFH","YES","TBA","Room Temp","AC Unit"]
["D","Heating + Air Con","Mitsubishi","ELECTRIC UFH","YES","TBA","Room Temp","Wired Controller"]
["D","Heating + Air Con","Mitsubishi","ELECTRIC UFH","YES","25 °C","Room Temp","Room Thimble Sensor"]
["D","Heating + Air Con","Mitsubishi","ELECTRIC UFH","YES","25 °C","Room Temp","AC Unit"]
["D","Heating + Air Con","Mitsubishi","ELECTRIC UFH","YES","25 °C","Room Temp","Wired Controller"]
["D","Heating + Air Con","Mitsubishi","ELECTRIC UFH","YES","26 °C","Room Temp","Room Thimble Sensor"]
["D","Heating + Air Con","Mitsubishi","ELECTRIC UFH","YES","26 °C","Room Temp","AC Unit"]
["D","Heating + Air Con","Mitsubishi","ELECTRIC UFH","YES","26 °C","Room Temp","Wired Controller"]
["D","Heating + Air Con","Mitsubishi","ELECTRIC UFH","YES","27 °C","Room Temp","Room Thimble Sensor"]
["D","Heating + Air Con","Mitsubishi","ELECTRIC UFH","YES","27 °C","Room Temp","AC Unit"]
["D","Heating + Air Con","Mitsubishi","ELECTRIC UFH","YES","27 °C","Room Temp","Wired Controller"]
["D","Heating + Air Con","Mitsubishi","ELECTRIC UFH","YES","28 °C","Room Temp","Room Thimble Sensor"]
["D","Heating + Air Con","Mitsubishi","ELECTRIC UFH","YES","28 °C","Room Temp","AC Unit"]
["D","Heating + Air Con","Mitsubishi","ELECTRIC UFH","YES","28 °C","Room Temp","Wired Controller"]
["D","Heating + Air Con","Mitsubishi","ELECTRIC UFH","YES","29 °C","Room Temp","Room Thimble Sensor"]
["D","Heating + Air Con","Mitsubishi","ELECTRIC UFH","YES","29 °C","Room Temp","AC Unit"]
["D","Heating + Air Con","Mitsubishi","ELECTRIC UFH","YES","29 °C","Room Temp","Wired Controller"]
["D","Heating + Air Con","Mitsubishi","ELECTRIC UFH","YES","30 °C","Room Temp","Room Thimble Sensor"]
["D","Heating + Air Con","Mitsubishi","ELECTRIC UFH","YES","30 °C","Room Temp","AC Unit"]
["D","Heating + Air Con","Mitsubishi","ELECTRIC UFH","YES","30 °C","Room Temp","Wired Controller"]
["D","Heating + Air Con","Mitsubishi","ELECTRIC UFH","YES","31 °C","Room Temp","Room Thimble Sensor"]
["D","Heating + Air Con","Mitsubishi","ELECTRIC UFH","YES","31 °C","Room Temp","AC Unit"]
["D","Heating + Air Con","Mitsubishi","ELECTRIC UFH","YES","31 °C","Room Temp","Wired Controller"]
["D","Heating + Air Con","Mitsubishi","ELECTRIC UFH","YES","32 °C","Room Temp","Room Thimble Sensor"]
["D","Heating + Air Con","Mitsubishi","ELECTRIC UFH","YES","32 °C","Room Temp","AC Unit"]
["D","Heating + Air Con","Mitsubishi","ELECTRIC UFH","YES","32 °C","Room Temp","Wired Controller"]
["D","Heating + Air Con","Mitsubishi","ELECTRIC UFH","YES","33 °C","Room Temp","Room Thimble Sensor"]
["D","Heating + Air Con","Mitsubishi","ELECTRIC UFH","YES","33 °C","Room Temp","AC Unit"]
["D","Heating + Air Con","Mitsubishi","ELECTRIC UFH","YES","33 °C","Room Temp","Wired Controller"]
["D","Heating + Air Con","Mitsubishi","ELECTRIC UFH","YES","34 °C","Room Temp","Room Thimble Sensor"]
["D","Heating + Air Con","Mitsubishi","ELECTRIC UFH","YES","34 °C","Room Temp","AC Unit"]
["D","Heating + Air Con","Mitsubishi","ELECTRIC UFH","YES","34 °C","Room Temp","Wired Controller"]
["D","Heating + Air Con","Mitsubishi","ELECTRIC UFH","YES","35 °C","Room Temp","Room Thimble Sensor"]
["D","Heating + Air Con","Mitsubishi","ELECTRIC UFH","YES","35 °C","Room Temp","AC Unit"]
["D","Heating + Air Con","Mitsubishi","ELECTRIC UFH","YES","35 °C","Room Temp","Wired Controller"]
["D","Heating + Air Con","Mitsubishi","ELECTRIC UFH","YES","36 °C","Room Temp","Room Thimble Sensor"]
["D","Heating + Air Con","Mitsubishi","ELECTRIC UFH","YES","36 °C","Room Temp","AC Unit"]
["D","Heating + Air Con","Mitsubishi","ELECTRIC UFH","YES","36 °C","Room Temp","Wired Controller"]
["D","Heating + Air Con","Mitsubishi","ELECTRIC UFH","YES","37 °C","Room Temp","Room Thimble Sensor"]
["D","Heating + Air Con","Mitsubishi","ELECTRIC UFH","YES","37 °C","Room Temp","AC Unit"]
["D","Heating + Air Con","Mitsubishi","ELECTRIC UFH","YES","37 °C","Room Temp","Wired Controller"]
["D","Heating + Air Con","Mitsubishi","ELECTRIC UFH","YES","38 °C","Room Temp","Room Thimble Sensor"]
["D","Heating + Air Con","Mitsubishi","ELECTRIC UFH","YES","38 °C","Room Temp","AC Unit"]
["D","Heating + Air Con","Mitsubishi","ELECTRIC UFH","YES","38 °C","Room Temp","Wired Controller"]
["D","Heating + Air Con","Mitsubishi","ELECTRIC UFH","YES","39 °C","Room Temp","Room Thimble Sensor"]
["D","Heating + Air Con","Mitsubishi","ELECTRIC UFH","YES","39 °C","Room Temp","AC Unit"]
["D","Heating + Air Con","Mitsubishi","ELECTRIC UFH","YES","39 °C","Room Temp","Wired Controller"]
["D","Heating + Air Con","Mitsubishi","ELECTRIC UFH","YES","40 °C","Room Temp","Room Thimble Sensor"]
["D","Heating + Air Con","Mitsubishi","ELECTRIC UFH","YES","40 °C","Room Temp","AC Unit"]
["D","Heating + Air Con","Mitsubishi","ELECTRIC UFH","YES","40 °C","Room Temp","Wired Controller"]
["E","Heating + Air Con","Mitsubishi","RADIATOR","N/A","N/A","Room Temp","Room Thimble Sensor"]
["E","Heating + Air Con","Mitsubishi","RADIATOR","N/A","N/A","Room Temp","AC Unit"]
["E","Heating + Air Con","Mitsubishi","RADIATOR","N/A","N/A","Room Temp","Wired Controller"]
["A","Heating + Air Con","Toshiba","WET UFH","NO","N/A","Room Temp","Room Thimble Sensor"]
["A","Heating + Air Con","Toshiba","WET UFH","NO","N/A","Room Temp","AC Unit"]
["A","Heating + Air Con","Toshiba","WET UFH","NO","N/A","Room Temp","Wired Controller"]
["B","Heating + Air Con","Toshiba","WET UFH","YES","TBA","Room Temp","Room Thimble Sensor"]
["B","Heating + Air Con","Toshiba","WET UFH","YES","TBA","Room Temp","AC Unit"]
["B","Heating + Air Con","Toshiba","WET UFH","YES","TBA","Room Temp","Wired Controller"]
["B","Heating + Air Con","Toshiba","WET UFH","YES","25 °C","Room Temp","Room Thimble Sensor"]
["B","Heating + Air Con","Toshiba","WET UFH","YES","25 °C","Room Temp","AC Unit"]
["B","Heating + Air Con","Toshiba","WET UFH","YES","25 °C","Room Temp","Wired Controller"]
["B","Heating + Air Con","Toshiba","WET UFH","YES","26 °C","Room Temp","Room Thimble Sensor"]
["B","Heating + Air Con","Toshiba","WET UFH","YES","26 °C","Room Temp","AC Unit"]
["B","Heating + Air Con","Toshiba","WET UFH","YES","26 °C","Room Temp","Wired Controller"]
["B","Heating + Air Con","Toshiba","WET UFH","YES","27 °C","Room Temp","Room Thimble Sensor"]
["B","Heating + Air Con","Toshiba","WET UFH","YES","27 °C","Room Temp","AC Unit"]
["B","Heating + Air Con","Toshiba","WET UFH","YES","27 °C","Room Temp","Wired Controller"]
["B","Heating + Air Con","Toshiba","WET UFH","YES","28 °C","Room Temp","Room Thimble Sensor"]
["B","Heating + Air Con","Toshiba","WET UFH","YES","28 °C","Room Temp","AC Unit"]
["B","Heating + Air Con","Toshiba","WET UFH","YES","28 °C","Room Temp","Wired Controller"]
["B","Heating + Air Con","Toshiba","WET UFH","YES","29 °C","Room Temp","Room Thimble Sensor"]
["B","Heating + Air Con","Toshiba","WET UFH","YES","29 °C","Room Temp","AC Unit"]
["B","Heating + Air Con","Toshiba","WET UFH","YES","29 °C","Room Temp","Wired Controller"]
["B","Heating + Air Con","Toshiba","WET UFH","YES","30 °C","Room Temp","Room Thimble Sensor"]
["B","Heating + Air Con","Toshiba","WET UFH","YES","30 °C","Room Temp","AC Unit"]
["B","Heating + Air Con","Toshiba","WET UFH","YES","30 °C","Room Temp","Wired Controller"]
["B","Heating + Air Con","Toshiba","WET UFH","YES","31 °C","Room Temp","Room Thimble Sensor"]
["B","Heating + Air Con","Toshiba","WET UFH","YES","31 °C","Room Temp","AC Unit"]
["B","Heating + Air Con","Toshiba","WET UFH","YES","31 °C","Room Temp","Wired Controller"]
["B","Heating + Air Con","Toshiba","WET UFH","YES","32 °C","Room Temp","Room Thimble Sensor"]
["B","Heating + Air Con","Toshiba","WET UFH","YES","32 °C","Room Temp","AC Unit"]
["B","Heating + Air Con","Toshiba","WET UFH","YES","32 °C","Room Temp","Wired Controller"]
["B","Heating + Air Con","Toshiba","WET UFH","YES","33 °C","Room Temp","Room Thimble Sensor"]
["B","Heating + Air Con","Toshiba","WET UFH","YES","33 °C","Room Temp","AC Unit"]
["B","Heating + Air Con","Toshiba","WET UFH","YES","33 °C","Room Temp","Wired Controller"]
["B","Heating + Air Con","Toshiba","WET UFH","YES","34 °C","Room Temp","Room Thimble Sensor"]
["B","Heating + Air Con","Toshiba","WET UFH","YES","34 °C","Room Temp","AC Unit"]
["B","Heating + Air Con","Toshiba","WET UFH","YES","34 °C","Room Temp","Wired Controller"]
["B","Heating + Air Con","Toshiba","WET UFH","YES","35 °C","Room Temp","Room Thimble Sensor"]
["B","Heating + Air Con","Toshiba","WET UFH","YES","35 °C","Room Temp","AC Unit"]
["B","Heating + Air Con","Toshiba","WET UFH","YES","35 °C","Room Temp","Wired Controller"]
["B","Heating + Air Con","Toshiba","WET UFH","YES","36 °C","Room Temp","Room Thimble Sensor"]
["B","Heating + Air Con","Toshiba","WET UFH","YES","36 °C","Room Temp","AC Unit"]
["B","Heating + Air Con","Toshiba","WET UFH","YES","36 °C","Room Temp","Wired Controller"]
["B","Heating + Air Con","Toshiba","WET UFH","YES","37 °C","Room Temp","Room Thimble Sensor"]
["B","Heating + Air Con","Toshiba","WET UFH","YES","37 °C","Room Temp","AC Unit"]
["B","Heating + Air Con","Toshiba","WET UFH","YES","37 °C","Room Temp","Wired Controller"]
["B","Heating + Air Con","Toshiba","WET UFH","YES","38 °C","Room Temp","Room Thimble Sensor"]
["B","Heating + Air Con","Toshiba","WET UFH","YES","38 °C","Room Temp","AC Unit"]
["B","Heating + Air Con","Toshiba","WET UFH","YES","38 °C","Room Temp","Wired Controller"]
["B","Heating + Air Con","Toshiba","WET UFH","YES","39 °C","Room Temp","Room Thimble Sensor"]
["B","Heating + Air Con","Toshiba","WET UFH","YES","39 °C","Room Temp","AC Unit"]
["B","Heating + Air Con","Toshiba","WET UFH","YES","39 °C","Room Temp","Wired Controller"]
["B","Heating + Air Con","Toshiba","WET UFH","YES","40 °C","Room Temp","Room Thimble Sensor"]
["B","Heating + Air Con","Toshiba","WET UFH","YES","40 °C","Room Temp","AC Unit"]
["B","Heating + Air Con","Toshiba","WET UFH","YES","40 °C","Room Temp","Wired Controller"]
["C","Heating + Air Con","Toshiba","ELECTRIC UFH","NO","N/A","Room Temp","Room Thimble Sensor"]
["C","Heating + Air Con","Toshiba","ELECTRIC UFH","NO","N/A","Room Temp","AC Unit"]
["C","Heating + Air Con","Toshiba","ELECTRIC UFH","NO","N/A","Room Temp","Wired Controller"]
["D","Heating + Air Con","Toshiba","ELECTRIC UFH","YES","TBA","Room Temp","Room Thimble Sensor"]
["D","Heating + Air Con","Toshiba","ELECTRIC UFH","YES","TBA","Room Temp","AC Unit"]
["D","Heating + Air Con","Toshiba","ELECTRIC UFH","YES","TBA","Room Temp","Wired Controller"]
["D","Heating + Air Con","Toshiba","ELECTRIC UFH","YES","25 °C","Room Temp","Room Thimble Sensor"]
["D","Heating + Air Con","Toshiba","ELECTRIC UFH","YES","25 °C","Room Temp","AC Unit"]
["D","Heating + Air Con","Toshiba","ELECTRIC UFH","YES","25 °C","Room Temp","Wired Controller"]
["D","Heating + Air Con","Toshiba","ELECTRIC UFH","YES","26 °C","Room Temp","Room Thimble Sensor"]
["D","Heating + Air Con","Toshiba","ELECTRIC UFH","YES","26 °C","Room Temp","AC Unit"]
["D","Heating + Air Con","Toshiba","ELECTRIC UFH","YES","26 °C","Room Temp","Wired Controller"]
["D","Heating + Air Con","Toshiba","ELECTRIC UFH","YES","27 °C","Room Temp","Room Thimble Sensor"]
["D","Heating + Air Con","Toshiba","ELECTRIC UFH","YES","27 °C","Room Temp","AC Unit"]
["D","Heating + Air Con","Toshiba","ELECTRIC UFH","YES","27 °C","Room Temp","Wired Controller"]
["D","Heating + Air Con","Toshiba","ELECTRIC UFH","YES","28 °C","Room Temp","Room Thimble Sensor"]
["D","Heating + Air Con","Toshiba","ELECTRIC UFH","YES","28 °C","Room Temp","AC Unit"]
["D","Heating + Air Con","Toshiba","ELECTRIC UFH","YES","28 °C","Room Temp","Wired Controller"]
["D","Heating + Air Con","Toshiba","ELECTRIC UFH","YES","29 °C","Room Temp","Room Thimble Sensor"]
["D","Heating + Air Con","Toshiba","ELECTRIC UFH","YES","29 °C","Room Temp","AC Unit"]
["D","Heating + Air Con","Toshiba","ELECTRIC UFH","YES","29 °C","Room Temp","Wired Controller"]
["D","Heating + Air Con","Toshiba","ELECTRIC UFH","YES","30 °C","Room Temp","Room Thimble Sensor"]
["D","Heating + Air Con","Toshiba","ELECTRIC UFH","YES","30 °C","Room Temp","AC Unit"]
["D","Heating + Air Con","Toshiba","ELECTRIC UFH","YES","30 °C","Room Temp","Wired Controller"]
["D","Heating + Air Con","Toshiba","ELECTRIC UFH","YES","31 °C","Room Temp","Room Thimble Sensor"]
["D","Heating + Air Con","Toshiba","ELECTRIC UFH","YES","31 °C","Room Temp","AC Unit"]
["D","Heating + Air Con","Toshiba","ELECTRIC UFH","YES","31 °C","Room Temp","Wired Controller"]
["D","Heating + Air Con","Toshiba","ELECTRIC UFH","YES","32 °C","Room Temp","Room Thimble Sensor"]
["D","Heating + Air Con","Toshiba","ELECTRIC UFH","YES","32 °C","Room Temp","AC Unit"]
["D","Heating + Air Con","Toshiba","ELECTRIC UFH","YES","32 °C","Room Temp","Wired Controller"]
["D","Heating + Air Con","Toshiba","ELECTRIC UFH","YES","33 °C","Room Temp","Room Thimble Sensor"]
["D","Heating + Air Con","Toshiba","ELECTRIC UFH","YES","33 °C","Room Temp","AC Unit"]
["D","Heating + Air Con","Toshiba","ELECTRIC UFH","YES","33 °C","Room Temp","Wired Controller"]
["D","Heating + Air Con","Toshiba","ELECTRIC UFH","YES","34 °C","Room Temp","Room Thimble Sensor"]
["D","Heating + Air Con","Toshiba","ELECTRIC UFH","YES","34 °C","Room Temp","AC Unit"]
["D","Heating + Air Con","Toshiba","ELECTRIC UFH","YES","34 °C","Room Temp","Wired Controller"]
["D","Heating + Air Con","Toshiba","ELECTRIC UFH","YES","35 °C","Room Temp","Room Thimble Sensor"]
["D","Heating + Air Con","Toshiba","ELECTRIC UFH","YES","35 °C","Room Temp","AC Unit"]
["D","Heating + Air Con","Toshiba","ELECTRIC UFH","YES","35 °C","Room Temp","Wired Controller"]
["D","Heating + Air Con","Toshiba","ELECTRIC UFH","YES","36 °C","Room Temp","Room Thimble Sensor"]
["D","Heating + Air Con","Toshiba","ELECTRIC UFH","YES","36 °C","Room Temp","AC Unit"]
["D","Heating + Air Con","Toshiba","ELECTRIC UFH","YES","36 °C","Room Temp","Wired Controller"]
["D","Heating + Air Con","Toshiba","ELECTRIC UFH","YES","37 °C","Room Temp","Room Thimble Sensor"]
["D","Heating + Air Con","Toshiba","ELECTRIC UFH","YES","37 °C","Room Temp","AC Unit"]
["D","Heating + Air Con","Toshiba","ELECTRIC UFH","YES","37 °C","Room Temp","Wired Controller"]
["D","Heating + Air Con","Toshiba","ELECTRIC UFH","YES","38 °C","Room Temp","Room Thimble Sensor"]
["D","Heating + Air Con","Toshiba","ELECTRIC UFH","YES","38 °C","Room Temp","AC Unit"]
["D","Heating + Air Con","Toshiba","ELECTRIC UFH","YES","38 °C","Room Temp","Wired Controller"]
["D","Heating + Air Con","Toshiba","ELECTRIC UFH","YES","39 °C","Room Temp","Room Thimble Sensor"]
["D","Heating + Air Con","Toshiba","ELECTRIC UFH","YES","39 °C","Room Temp","AC Unit"]
["D","Heating + Air Con","Toshiba","ELECTRIC UFH","YES","39 °C","Room Temp","Wired Controller"]
["D","Heating + Air Con","Toshiba","ELECTRIC UFH","YES","40 °C","Room Temp","Room Thimble Sensor"]
["D","Heating + Air Con","Toshiba","ELECTRIC UFH","YES","40 °C","Room Temp","AC Unit"]
["D","Heating + Air Con","Toshiba","ELECTRIC UFH","YES","40 °C","Room Temp","Wired Controller"]
["E","Heating + Air Con","Toshiba","RADIATOR","N/A","N/A","Room Temp","Room Thimble Sensor"]
["E","Heating + Air Con","Toshiba","RADIATOR","N/A","N/A","Room Temp","AC Unit"]
["E","Heating + Air Con","Toshiba","RADIATOR","N/A","N/A","Room Temp","Wired Controller"]
["A","Heating + Air Con","Sanyo ","WET UFH","NO","N/A","Room Temp","Room Thimble Sensor"]
["A","Heating + Air Con","Sanyo ","WET UFH","NO","N/A","Room Temp","AC Unit"]
["A","Heating + Air Con","Sanyo ","WET UFH","NO","N/A","Room Temp","Wired Controller"]
["B","Heating + Air Con","Sanyo ","WET UFH","YES","TBA","Room Temp","Room Thimble Sensor"]
["B","Heating + Air Con","Sanyo ","WET UFH","YES","TBA","Room Temp","AC Unit"]
["B","Heating + Air Con","Sanyo ","WET UFH","YES","TBA","Room Temp","Wired Controller"]
["B","Heating + Air Con","Sanyo ","WET UFH","YES","25 °C","Room Temp","Room Thimble Sensor"]
["B","Heating + Air Con","Sanyo ","WET UFH","YES","25 °C","Room Temp","AC Unit"]
["B","Heating + Air Con","Sanyo ","WET UFH","YES","25 °C","Room Temp","Wired Controller"]
["B","Heating + Air Con","Sanyo ","WET UFH","YES","26 °C","Room Temp","Room Thimble Sensor"]
["B","Heating + Air Con","Sanyo ","WET UFH","YES","26 °C","Room Temp","AC Unit"]
["B","Heating + Air Con","Sanyo ","WET UFH","YES","26 °C","Room Temp","Wired Controller"]
["B","Heating + Air Con","Sanyo ","WET UFH","YES","27 °C","Room Temp","Room Thimble Sensor"]
["B","Heating + Air Con","Sanyo ","WET UFH","YES","27 °C","Room Temp","AC Unit"]
["B","Heating + Air Con","Sanyo ","WET UFH","YES","27 °C","Room Temp","Wired Controller"]
["B","Heating + Air Con","Sanyo ","WET UFH","YES","28 °C","Room Temp","Room Thimble Sensor"]
["B","Heating + Air Con","Sanyo ","WET UFH","YES","28 °C","Room Temp","AC Unit"]
["B","Heating + Air Con","Sanyo ","WET UFH","YES","28 °C","Room Temp","Wired Controller"]
["B","Heating + Air Con","Sanyo ","WET UFH","YES","29 °C","Room Temp","Room Thimble Sensor"]
["B","Heating + Air Con","Sanyo ","WET UFH","YES","29 °C","Room Temp","AC Unit"]
["B","Heating + Air Con","Sanyo ","WET UFH","YES","29 °C","Room Temp","Wired Controller"]
["B","Heating + Air Con","Sanyo ","WET UFH","YES","30 °C","Room Temp","Room Thimble Sensor"]
["B","Heating + Air Con","Sanyo ","WET UFH","YES","30 °C","Room Temp","AC Unit"]
["B","Heating + Air Con","Sanyo ","WET UFH","YES","30 °C","Room Temp","Wired Controller"]
["B","Heating + Air Con","Sanyo ","WET UFH","YES","31 °C","Room Temp","Room Thimble Sensor"]
["B","Heating + Air Con","Sanyo ","WET UFH","YES","31 °C","Room Temp","AC Unit"]
["B","Heating + Air Con","Sanyo ","WET UFH","YES","31 °C","Room Temp","Wired Controller"]
["B","Heating + Air Con","Sanyo ","WET UFH","YES","32 °C","Room Temp","Room Thimble Sensor"]
["B","Heating + Air Con","Sanyo ","WET UFH","YES","32 °C","Room Temp","AC Unit"]
["B","Heating + Air Con","Sanyo ","WET UFH","YES","32 °C","Room Temp","Wired Controller"]
["B","Heating + Air Con","Sanyo ","WET UFH","YES","33 °C","Room Temp","Room Thimble Sensor"]
["B","Heating + Air Con","Sanyo ","WET UFH","YES","33 °C","Room Temp","AC Unit"]
["B","Heating + Air Con","Sanyo ","WET UFH","YES","33 °C","Room Temp","Wired Controller"]
["B","Heating + Air Con","Sanyo ","WET UFH","YES","34 °C","Room Temp","Room Thimble Sensor"]
["B","Heating + Air Con","Sanyo ","WET UFH","YES","34 °C","Room Temp","AC Unit"]
["B","Heating + Air Con","Sanyo ","WET UFH","YES","34 °C","Room Temp","Wired Controller"]
["B","Heating + Air Con","Sanyo ","WET UFH","YES","35 °C","Room Temp","Room Thimble Sensor"]
["B","Heating + Air Con","Sanyo ","WET UFH","YES","35 °C","Room Temp","AC Unit"]
["B","Heating + Air Con","Sanyo ","WET UFH","YES","35 °C","Room Temp","Wired Controller"]
["B","Heating + Air Con","Sanyo ","WET UFH","YES","36 °C","Room Temp","Room Thimble Sensor"]
["B","Heating + Air Con","Sanyo ","WET UFH","YES","36 °C","Room Temp","AC Unit"]
["B","Heating + Air Con","Sanyo ","WET UFH","YES","36 °C","Room Temp","Wired Controller"]
["B","Heating + Air Con","Sanyo ","WET UFH","YES","37 °C","Room Temp","Room Thimble Sensor"]
["B","Heating + Air Con","Sanyo ","WET UFH","YES","37 °C","Room Temp","AC Unit"]
["B","Heating + Air Con","Sanyo ","WET UFH","YES","37 °C","Room Temp","Wired Controller"]
["B","Heating + Air Con","Sanyo ","WET UFH","YES","38 °C","Room Temp","Room Thimble Sensor"]
["B","Heating + Air Con","Sanyo ","WET UFH","YES","38 °C","Room Temp","AC Unit"]
["B","Heating + Air Con","Sanyo ","WET UFH","YES","38 °C","Room Temp","Wired Controller"]
["B","Heating + Air Con","Sanyo ","WET UFH","YES","39 °C","Room Temp","Room Thimble Sensor"]
["B","Heating + Air Con","Sanyo ","WET UFH","YES","39 °C","Room Temp","AC Unit"]
["B","Heating + Air Con","Sanyo ","WET UFH","YES","39 °C","Room Temp","Wired Controller"]
["B","Heating + Air Con","Sanyo ","WET UFH","YES","40 °C","Room Temp","Room Thimble Sensor"]
["B","Heating + Air Con","Sanyo ","WET UFH","YES","40 °C","Room Temp","AC Unit"]
["B","Heating + Air Con","Sanyo ","WET UFH","YES","40 °C","Room Temp","Wired Controller"]
["C","Heating + Air Con","Sanyo ","ELECTRIC UFH","NO","N/A","Room Temp","Room Thimble Sensor"]
["C","Heating + Air Con","Sanyo ","ELECTRIC UFH","NO","N/A","Room Temp","AC Unit"]
["C","Heating + Air Con","Sanyo ","ELECTRIC UFH","NO","N/A","Room Temp","Wired Controller"]
["D","Heating + Air Con","Sanyo ","ELECTRIC UFH","YES","TBA","Room Temp","Room Thimble Sensor"]
["D","Heating + Air Con","Sanyo ","ELECTRIC UFH","YES","TBA","Room Temp","AC Unit"]
["D","Heating + Air Con","Sanyo ","ELECTRIC UFH","YES","TBA","Room Temp","Wired Controller"]
["D","Heating + Air Con","Sanyo ","ELECTRIC UFH","YES","25 °C","Room Temp","Room Thimble Sensor"]
["D","Heating + Air Con","Sanyo ","ELECTRIC UFH","YES","25 °C","Room Temp","AC Unit"]
["D","Heating + Air Con","Sanyo ","ELECTRIC UFH","YES","25 °C","Room Temp","Wired Controller"]
["D","Heating + Air Con","Sanyo ","ELECTRIC UFH","YES","26 °C","Room Temp","Room Thimble Sensor"]
["D","Heating + Air Con","Sanyo ","ELECTRIC UFH","YES","26 °C","Room Temp","AC Unit"]
["D","Heating + Air Con","Sanyo ","ELECTRIC UFH","YES","26 °C","Room Temp","Wired Controller"]
["D","Heating + Air Con","Sanyo ","ELECTRIC UFH","YES","27 °C","Room Temp","Room Thimble Sensor"]
["D","Heating + Air Con","Sanyo ","ELECTRIC UFH","YES","27 °C","Room Temp","AC Unit"]
["D","Heating + Air Con","Sanyo ","ELECTRIC UFH","YES","27 °C","Room Temp","Wired Controller"]
["D","Heating + Air Con","Sanyo ","ELECTRIC UFH","YES","28 °C","Room Temp","Room Thimble Sensor"]
["D","Heating + Air Con","Sanyo ","ELECTRIC UFH","YES","28 °C","Room Temp","AC Unit"]
["D","Heating + Air Con","Sanyo ","ELECTRIC UFH","YES","28 °C","Room Temp","Wired Controller"]
["D","Heating + Air Con","Sanyo ","ELECTRIC UFH","YES","29 °C","Room Temp","Room Thimble Sensor"]
["D","Heating + Air Con","Sanyo ","ELECTRIC UFH","YES","29 °C","Room Temp","AC Unit"]
["D","Heating + Air Con","Sanyo ","ELECTRIC UFH","YES","29 °C","Room Temp","Wired Controller"]
["D","Heating + Air Con","Sanyo ","ELECTRIC UFH","YES","30 °C","Room Temp","Room Thimble Sensor"]
["D","Heating + Air Con","Sanyo ","ELECTRIC UFH","YES","30 °C","Room Temp","AC Unit"]
["D","Heating + Air Con","Sanyo ","ELECTRIC UFH","YES","30 °C","Room Temp","Wired Controller"]
["D","Heating + Air Con","Sanyo ","ELECTRIC UFH","YES","31 °C","Room Temp","Room Thimble Sensor"]
["D","Heating + Air Con","Sanyo ","ELECTRIC UFH","YES","31 °C","Room Temp","AC Unit"]
["D","Heating + Air Con","Sanyo ","ELECTRIC UFH","YES","31 °C","Room Temp","Wired Controller"]
["D","Heating + Air Con","Sanyo ","ELECTRIC UFH","YES","32 °C","Room Temp","Room Thimble Sensor"]
["D","Heating + Air Con","Sanyo ","ELECTRIC UFH","YES","32 °C","Room Temp","AC Unit"]
["D","Heating + Air Con","Sanyo ","ELECTRIC UFH","YES","32 °C","Room Temp","Wired Controller"]
["D","Heating + Air Con","Sanyo ","ELECTRIC UFH","YES","33 °C","Room Temp","Room Thimble Sensor"]
["D","Heating + Air Con","Sanyo ","ELECTRIC UFH","YES","33 °C","Room Temp","AC Unit"]
["D","Heating + Air Con","Sanyo ","ELECTRIC UFH","YES","33 °C","Room Temp","Wired Controller"]
["D","Heating + Air Con","Sanyo ","ELECTRIC UFH","YES","34 °C","Room Temp","Room Thimble Sensor"]
["D","Heating + Air Con","Sanyo ","ELECTRIC UFH","YES","34 °C","Room Temp","AC Unit"]
["D","Heating + Air Con","Sanyo ","ELECTRIC UFH","YES","34 °C","Room Temp","Wired Controller"]
["D","Heating + Air Con","Sanyo ","ELECTRIC UFH","YES","35 °C","Room Temp","Room Thimble Sensor"]
["D","Heating + Air Con","Sanyo ","ELECTRIC UFH","YES","35 °C","Room Temp","AC Unit"]
["D","Heating + Air Con","Sanyo ","ELECTRIC UFH","YES","35 °C","Room Temp","Wired Controller"]
["D","Heating + Air Con","Sanyo ","ELECTRIC UFH","YES","36 °C","Room Temp","Room Thimble Sensor"]
["D","Heating + Air Con","Sanyo ","ELECTRIC UFH","YES","36 °C","Room Temp","AC Unit"]
["D","Heating + Air Con","Sanyo ","ELECTRIC UFH","YES","36 °C","Room Temp","Wired Controller"]
["D","Heating + Air Con","Sanyo ","ELECTRIC UFH","YES","37 °C","Room Temp","Room Thimble Sensor"]
["D","Heating + Air Con","Sanyo ","ELECTRIC UFH","YES","37 °C","Room Temp","AC Unit"]
["D","Heating + Air Con","Sanyo ","ELECTRIC UFH","YES","37 °C","Room Temp","Wired Controller"]
["D","Heating + Air Con","Sanyo ","ELECTRIC UFH","YES","38 °C","Room Temp","Room Thimble Sensor"]
["D","Heating + Air Con","Sanyo ","ELECTRIC UFH","YES","38 °C","Room Temp","AC Unit"]
["D","Heating + Air Con","Sanyo ","ELECTRIC UFH","YES","38 °C","Room Temp","Wired Controller"]
["D","Heating + Air Con","Sanyo ","ELECTRIC UFH","YES","39 °C","Room Temp","Room Thimble Sensor"]
["D","Heating + Air Con","Sanyo ","ELECTRIC UFH","YES","39 °C","Room Temp","AC Unit"]
["D","Heating + Air Con","Sanyo ","ELECTRIC UFH","YES","39 °C","Room Temp","Wired Controller"]
["D","Heating + Air Con","Sanyo ","ELECTRIC UFH","YES","40 °C","Room Temp","Room Thimble Sensor"]
["D","Heating + Air Con","Sanyo ","ELECTRIC UFH","YES","40 °C","Room Temp","AC Unit"]
["D","Heating + Air Con","Sanyo ","ELECTRIC UFH","YES","40 °C","Room Temp","Wired Controller"]
["E","Heating + Air Con","Sanyo ","RADIATOR","N/A","N/A","Room Temp","Room Thimble Sensor"]
["E","Heating + Air Con","Sanyo ","RADIATOR","N/A","N/A","Room Temp","AC Unit"]
["E","Heating + Air Con","Sanyo ","RADIATOR","N/A","N/A","Room Temp","Wired Controller"]
["A","Heating + Air Con","Panasonic ","WET UFH","NO","N/A","Room Temp","Room Thimble Sensor"]
["A","Heating + Air Con","Panasonic ","WET UFH","NO","N/A","Room Temp","AC Unit"]
["A","Heating + Air Con","Panasonic ","WET UFH","NO","N/A","Room Temp","Wired Controller"]
["B","Heating + Air Con","Panasonic ","WET UFH","YES","TBA","Room Temp","Room Thimble Sensor"]
["B","Heating + Air Con","Panasonic ","WET UFH","YES","TBA","Room Temp","AC Unit"]
["B","Heating + Air Con","Panasonic ","WET UFH","YES","TBA","Room Temp","Wired Controller"]
["B","Heating + Air Con","Panasonic ","WET UFH","YES","25 °C","Room Temp","Room Thimble Sensor"]
["B","Heating + Air Con","Panasonic ","WET UFH","YES","25 °C","Room Temp","AC Unit"]
["B","Heating + Air Con","Panasonic ","WET UFH","YES","25 °C","Room Temp","Wired Controller"]
["B","Heating + Air Con","Panasonic ","WET UFH","YES","26 °C","Room Temp","Room Thimble Sensor"]
["B","Heating + Air Con","Panasonic ","WET UFH","YES","26 °C","Room Temp","AC Unit"]
["B","Heating + Air Con","Panasonic ","WET UFH","YES","26 °C","Room Temp","Wired Controller"]
["B","Heating + Air Con","Panasonic ","WET UFH","YES","27 °C","Room Temp","Room Thimble Sensor"]
["B","Heating + Air Con","Panasonic ","WET UFH","YES","27 °C","Room Temp","AC Unit"]
["B","Heating + Air Con","Panasonic ","WET UFH","YES","27 °C","Room Temp","Wired Controller"]
["B","Heating + Air Con","Panasonic ","WET UFH","YES","28 °C","Room Temp","Room Thimble Sensor"]
["B","Heating + Air Con","Panasonic ","WET UFH","YES","28 °C","Room Temp","AC Unit"]
["B","Heating + Air Con","Panasonic ","WET UFH","YES","28 °C","Room Temp","Wired Controller"]
["B","Heating + Air Con","Panasonic ","WET UFH","YES","29 °C","Room Temp","Room Thimble Sensor"]
["B","Heating + Air Con","Panasonic ","WET UFH","YES","29 °C","Room Temp","AC Unit"]
["B","Heating + Air Con","Panasonic ","WET UFH","YES","29 °C","Room Temp","Wired Controller"]
["B","Heating + Air Con","Panasonic ","WET UFH","YES","30 °C","Room Temp","Room Thimble Sensor"]
["B","Heating + Air Con","Panasonic ","WET UFH","YES","30 °C","Room Temp","AC Unit"]
["B","Heating + Air Con","Panasonic ","WET UFH","YES","30 °C","Room Temp","Wired Controller"]
["B","Heating + Air Con","Panasonic ","WET UFH","YES","31 °C","Room Temp","Room Thimble Sensor"]
["B","Heating + Air Con","Panasonic ","WET UFH","YES","31 °C","Room Temp","AC Unit"]
["B","Heating + Air Con","Panasonic ","WET UFH","YES","31 °C","Room Temp","Wired Controller"]
["B","Heating + Air Con","Panasonic ","WET UFH","YES","32 °C","Room Temp","Room Thimble Sensor"]
["B","Heating + Air Con","Panasonic ","WET UFH","YES","32 °C","Room Temp","AC Unit"]
["B","Heating + Air Con","Panasonic ","WET UFH","YES","32 °C","Room Temp","Wired Controller"]
["B","Heating + Air Con","Panasonic ","WET UFH","YES","33 °C","Room Temp","Room Thimble Sensor"]
["B","Heating + Air Con","Panasonic ","WET UFH","YES","33 °C","Room Temp","AC Unit"]
["B","Heating + Air Con","Panasonic ","WET UFH","YES","33 °C","Room Temp","Wired Controller"]
["B","Heating + Air Con","Panasonic ","WET UFH","YES","34 °C","Room Temp","Room Thimble Sensor"]
["B","Heating + Air Con","Panasonic ","WET UFH","YES","34 °C","Room Temp","AC Unit"]
["B","Heating + Air Con","Panasonic ","WET UFH","YES","34 °C","Room Temp","Wired Controller"]
["B","Heating + Air Con","Panasonic ","WET UFH","YES","35 °C","Room Temp","Room Thimble Sensor"]
["B","Heating + Air Con","Panasonic ","WET UFH","YES","35 °C","Room Temp","AC Unit"]
["B","Heating + Air Con","Panasonic ","WET UFH","YES","35 °C","Room Temp","Wired Controller"]
["B","Heating + Air Con","Panasonic ","WET UFH","YES","36 °C","Room Temp","Room Thimble Sensor"]
["B","Heating + Air Con","Panasonic ","WET UFH","YES","36 °C","Room Temp","AC Unit"]
["B","Heating + Air Con","Panasonic ","WET UFH","YES","36 °C","Room Temp","Wired Controller"]
["B","Heating + Air Con","Panasonic ","WET UFH","YES","37 °C","Room Temp","Room Thimble Sensor"]
["B","Heating + Air Con","Panasonic ","WET UFH","YES","37 °C","Room Temp","AC Unit"]
["B","Heating + Air Con","Panasonic ","WET UFH","YES","37 °C","Room Temp","Wired Controller"]
["B","Heating + Air Con","Panasonic ","WET UFH","YES","38 °C","Room Temp","Room Thimble Sensor"]
["B","Heating + Air Con","Panasonic ","WET UFH","YES","38 °C","Room Temp","AC Unit"]
["B","Heating + Air Con","Panasonic ","WET UFH","YES","38 °C","Room Temp","Wired Controller"]
["B","Heating + Air Con","Panasonic ","WET UFH","YES","39 °C","Room Temp","Room Thimble Sensor"]
["B","Heating + Air Con","Panasonic ","WET UFH","YES","39 °C","Room Temp","AC Unit"]
["B","Heating + Air Con","Panasonic ","WET UFH","YES","39 °C","Room Temp","Wired Controller"]
["B","Heating + Air Con","Panasonic ","WET UFH","YES","40 °C","Room Temp","Room Thimble Sensor"]
["B","Heating + Air Con","Panasonic ","WET UFH","YES","40 °C","Room Temp","AC Unit"]
["B","Heating + Air Con","Panasonic ","WET UFH","YES","40 °C","Room Temp","Wired Controller"]
["C","Heating + Air Con","Panasonic ","ELECTRIC UFH","NO","N/A","Room Temp","Room Thimble Sensor"]
["C","Heating + Air Con","Panasonic ","ELECTRIC UFH","NO","N/A","Room Temp","AC Unit"]
["C","Heating + Air Con","Panasonic ","ELECTRIC UFH","NO","N/A","Room Temp","Wired Controller"]
["D","Heating + Air Con","Panasonic ","ELECTRIC UFH","YES","TBA","Room Temp","Room Thimble Sensor"]
["D","Heating + Air Con","Panasonic ","ELECTRIC UFH","YES","TBA","Room Temp","AC Unit"]
["D","Heating + Air Con","Panasonic ","ELECTRIC UFH","YES","TBA","Room Temp","Wired Controller"]
["D","Heating + Air Con","Panasonic ","ELECTRIC UFH","YES","25 °C","Room Temp","Room Thimble Sensor"]
["D","Heating + Air Con","Panasonic ","ELECTRIC UFH","YES","25 °C","Room Temp","AC Unit"]
["D","Heating + Air Con","Panasonic ","ELECTRIC UFH","YES","25 °C","Room Temp","Wired Controller"]
["D","Heating + Air Con","Panasonic ","ELECTRIC UFH","YES","26 °C","Room Temp","Room Thimble Sensor"]
["D","Heating + Air Con","Panasonic ","ELECTRIC UFH","YES","26 °C","Room Temp","AC Unit"]
["D","Heating + Air Con","Panasonic ","ELECTRIC UFH","YES","26 °C","Room Temp","Wired Controller"]
["D","Heating + Air Con","Panasonic ","ELECTRIC UFH","YES","27 °C","Room Temp","Room Thimble Sensor"]
["D","Heating + Air Con","Panasonic ","ELECTRIC UFH","YES","27 °C","Room Temp","AC Unit"]
["D","Heating + Air Con","Panasonic ","ELECTRIC UFH","YES","27 °C","Room Temp","Wired Controller"]
["D","Heating + Air Con","Panasonic ","ELECTRIC UFH","YES","28 °C","Room Temp","Room Thimble Sensor"]
["D","Heating + Air Con","Panasonic ","ELECTRIC UFH","YES","28 °C","Room Temp","AC Unit"]
["D","Heating + Air Con","Panasonic ","ELECTRIC UFH","YES","28 °C","Room Temp","Wired Controller"]
["D","Heating + Air Con","Panasonic ","ELECTRIC UFH","YES","29 °C","Room Temp","Room Thimble Sensor"]
["D","Heating + Air Con","Panasonic ","ELECTRIC UFH","YES","29 °C","Room Temp","AC Unit"]
["D","Heating + Air Con","Panasonic ","ELECTRIC UFH","YES","29 °C","Room Temp","Wired Controller"]
["D","Heating + Air Con","Panasonic ","ELECTRIC UFH","YES","30 °C","Room Temp","Room Thimble Sensor"]
["D","Heating + Air Con","Panasonic ","ELECTRIC UFH","YES","30 °C","Room Temp","AC Unit"]
["D","Heating + Air Con","Panasonic ","ELECTRIC UFH","YES","30 °C","Room Temp","Wired Controller"]
["D","Heating + Air Con","Panasonic ","ELECTRIC UFH","YES","31 °C","Room Temp","Room Thimble Sensor"]
["D","Heating + Air Con","Panasonic ","ELECTRIC UFH","YES","31 °C","Room Temp","AC Unit"]
["D","Heating + Air Con","Panasonic ","ELECTRIC UFH","YES","31 °C","Room Temp","Wired Controller"]
["D","Heating + Air Con","Panasonic ","ELECTRIC UFH","YES","32 °C","Room Temp","Room Thimble Sensor"]
["D","Heating + Air Con","Panasonic ","ELECTRIC UFH","YES","32 °C","Room Temp","AC Unit"]
["D","Heating + Air Con","Panasonic ","ELECTRIC UFH","YES","32 °C","Room Temp","Wired Controller"]
["D","Heating + Air Con","Panasonic ","ELECTRIC UFH","YES","33 °C","Room Temp","Room Thimble Sensor"]
["D","Heating + Air Con","Panasonic ","ELECTRIC UFH","YES","33 °C","Room Temp","AC Unit"]
["D","Heating + Air Con","Panasonic ","ELECTRIC UFH","YES","33 °C","Room Temp","Wired Controller"]
["D","Heating + Air Con","Panasonic ","ELECTRIC UFH","YES","34 °C","Room Temp","Room Thimble Sensor"]
["D","Heating + Air Con","Panasonic ","ELECTRIC UFH","YES","34 °C","Room Temp","AC Unit"]
["D","Heating + Air Con","Panasonic ","ELECTRIC UFH","YES","34 °C","Room Temp","Wired Controller"]
["D","Heating + Air Con","Panasonic ","ELECTRIC UFH","YES","35 °C","Room Temp","Room Thimble Sensor"]
["D","Heating + Air Con","Panasonic ","ELECTRIC UFH","YES","35 °C","Room Temp","AC Unit"]
["D","Heating + Air Con","Panasonic ","ELECTRIC UFH","YES","35 °C","Room Temp","Wired Controller"]
["D","Heating + Air Con","Panasonic ","ELECTRIC UFH","YES","36 °C","Room Temp","Room Thimble Sensor"]
["D","Heating + Air Con","Panasonic ","ELECTRIC UFH","YES","36 °C","Room Temp","AC Unit"]
["D","Heating + Air Con","Panasonic ","ELECTRIC UFH","YES","36 °C","Room Temp","Wired Controller"]
["D","Heating + Air Con","Panasonic ","ELECTRIC UFH","YES","37 °C","Room Temp","Room Thimble Sensor"]
["D","Heating + Air Con","Panasonic ","ELECTRIC UFH","YES","37 °C","Room Temp","AC Unit"]
["D","Heating + Air Con","Panasonic ","ELECTRIC UFH","YES","37 °C","Room Temp","Wired Controller"]
["D","Heating + Air Con","Panasonic ","ELECTRIC UFH","YES","38 °C","Room Temp","Room Thimble Sensor"]
["D","Heating + Air Con","Panasonic ","ELECTRIC UFH","YES","38 °C","Room Temp","AC Unit"]
["D","Heating + Air Con","Panasonic ","ELECTRIC UFH","YES","38 °C","Room Temp","Wired Controller"]
["D","Heating + Air Con","Panasonic ","ELECTRIC UFH","YES","39 °C","Room Temp","Room Thimble Sensor"]
["D","Heating + Air Con","Panasonic ","ELECTRIC UFH","YES","39 °C","Room Temp","AC Unit"]
["D","Heating + Air Con","Panasonic ","ELECTRIC UFH","YES","39 °C","Room Temp","Wired Controller"]
["D","Heating + Air Con","Panasonic ","ELECTRIC UFH","YES","40 °C","Room Temp","Room Thimble Sensor"]
["D","Heating + Air Con","Panasonic ","ELECTRIC UFH","YES","40 °C","Room Temp","AC Unit"]
["D","Heating + Air Con","Panasonic ","ELECTRIC UFH","YES","40 °C","Room Temp","Wired Controller"]
["E","Heating + Air Con","Panasonic ","RADIATOR","N/A","N/A","Room Temp","Room Thimble Sensor"]
["E","Heating + Air Con","Panasonic ","RADIATOR","N/A","N/A","Room Temp","AC Unit"]
["E","Heating + Air Con","Panasonic ","RADIATOR","N/A","N/A","Room Temp","Wired Controller"]
["A","Heating + Air Con","Fujitsu ","WET UFH","NO","N/A","Room Temp","Room Thimble Sensor"]
["A","Heating + Air Con","Fujitsu ","WET UFH","NO","N/A","Room Temp","AC Unit"]
["A","Heating + Air Con","Fujitsu ","WET UFH","NO","N/A","Room Temp","Wired Controller"]
["B","Heating + Air Con","Fujitsu ","WET UFH","YES","TBA","Room Temp","Room Thimble Sensor"]
["B","Heating + Air Con","Fujitsu ","WET UFH","YES","TBA","Room Temp","AC Unit"]
["B","Heating + Air Con","Fujitsu ","WET UFH","YES","TBA","Room Temp","Wired Controller"]
["B","Heating + Air Con","Fujitsu ","WET UFH","YES","25 °C","Room Temp","Room Thimble Sensor"]
["B","Heating + Air Con","Fujitsu ","WET UFH","YES","25 °C","Room Temp","AC Unit"]
["B","Heating + Air Con","Fujitsu ","WET UFH","YES","25 °C","Room Temp","Wired Controller"]
["B","Heating + Air Con","Fujitsu ","WET UFH","YES","26 °C","Room Temp","Room Thimble Sensor"]
["B","Heating + Air Con","Fujitsu ","WET UFH","YES","26 °C","Room Temp","AC Unit"]
["B","Heating + Air Con","Fujitsu ","WET UFH","YES","26 °C","Room Temp","Wired Controller"]
["B","Heating + Air Con","Fujitsu ","WET UFH","YES","27 °C","Room Temp","Room Thimble Sensor"]
["B","Heating + Air Con","Fujitsu ","WET UFH","YES","27 °C","Room Temp","AC Unit"]
["B","Heating + Air Con","Fujitsu ","WET UFH","YES","27 °C","Room Temp","Wired Controller"]
["B","Heating + Air Con","Fujitsu ","WET UFH","YES","28 °C","Room Temp","Room Thimble Sensor"]
["B","Heating + Air Con","Fujitsu ","WET UFH","YES","28 °C","Room Temp","AC Unit"]
["B","Heating + Air Con","Fujitsu ","WET UFH","YES","28 °C","Room Temp","Wired Controller"]
["B","Heating + Air Con","Fujitsu ","WET UFH","YES","29 °C","Room Temp","Room Thimble Sensor"]
["B","Heating + Air Con","Fujitsu ","WET UFH","YES","29 °C","Room Temp","AC Unit"]
["B","Heating + Air Con","Fujitsu ","WET UFH","YES","29 °C","Room Temp","Wired Controller"]
["B","Heating + Air Con","Fujitsu ","WET UFH","YES","30 °C","Room Temp","Room Thimble Sensor"]
["B","Heating + Air Con","Fujitsu ","WET UFH","YES","30 °C","Room Temp","AC Unit"]
["B","Heating + Air Con","Fujitsu ","WET UFH","YES","30 °C","Room Temp","Wired Controller"]
["B","Heating + Air Con","Fujitsu ","WET UFH","YES","31 °C","Room Temp","Room Thimble Sensor"]
["B","Heating + Air Con","Fujitsu ","WET UFH","YES","31 °C","Room Temp","AC Unit"]
["B","Heating + Air Con","Fujitsu ","WET UFH","YES","31 °C","Room Temp","Wired Controller"]
["B","Heating + Air Con","Fujitsu ","WET UFH","YES","32 °C","Room Temp","Room Thimble Sensor"]
["B","Heating + Air Con","Fujitsu ","WET UFH","YES","32 °C","Room Temp","AC Unit"]
["B","Heating + Air Con","Fujitsu ","WET UFH","YES","32 °C","Room Temp","Wired Controller"]
["B","Heating + Air Con","Fujitsu ","WET UFH","YES","33 °C","Room Temp","Room Thimble Sensor"]
["B","Heating + Air Con","Fujitsu ","WET UFH","YES","33 °C","Room Temp","AC Unit"]
["B","Heating + Air Con","Fujitsu ","WET UFH","YES","33 °C","Room Temp","Wired Controller"]
["B","Heating + Air Con","Fujitsu ","WET UFH","YES","34 °C","Room Temp","Room Thimble Sensor"]
["B","Heating + Air Con","Fujitsu ","WET UFH","YES","34 °C","Room Temp","AC Unit"]
["B","Heating + Air Con","Fujitsu ","WET UFH","YES","34 °C","Room Temp","Wired Controller"]
["B","Heating + Air Con","Fujitsu ","WET UFH","YES","35 °C","Room Temp","Room Thimble Sensor"]
["B","Heating + Air Con","Fujitsu ","WET UFH","YES","35 °C","Room Temp","AC Unit"]
["B","Heating + Air Con","Fujitsu ","WET UFH","YES","35 °C","Room Temp","Wired Controller"]
["B","Heating + Air Con","Fujitsu ","WET UFH","YES","36 °C","Room Temp","Room Thimble Sensor"]
["B","Heating + Air Con","Fujitsu ","WET UFH","YES","36 °C","Room Temp","AC Unit"]
["B","Heating + Air Con","Fujitsu ","WET UFH","YES","36 °C","Room Temp","Wired Controller"]
["B","Heating + Air Con","Fujitsu ","WET UFH","YES","37 °C","Room Temp","Room Thimble Sensor"]
["B","Heating + Air Con","Fujitsu ","WET UFH","YES","37 °C","Room Temp","AC Unit"]
["B","Heating + Air Con","Fujitsu ","WET UFH","YES","37 °C","Room Temp","Wired Controller"]
["B","Heating + Air Con","Fujitsu ","WET UFH","YES","38 °C","Room Temp","Room Thimble Sensor"]
["B","Heating + Air Con","Fujitsu ","WET UFH","YES","38 °C","Room Temp","AC Unit"]
["B","Heating + Air Con","Fujitsu ","WET UFH","YES","38 °C","Room Temp","Wired Controller"]
["B","Heating + Air Con","Fujitsu ","WET UFH","YES","39 °C","Room Temp","Room Thimble Sensor"]
["B","Heating + Air Con","Fujitsu ","WET UFH","YES","39 °C","Room Temp","AC Unit"]
["B","Heating + Air Con","Fujitsu ","WET UFH","YES","39 °C","Room Temp","Wired Controller"]
["B","Heating + Air Con","Fujitsu ","WET UFH","YES","40 °C","Room Temp","Room Thimble Sensor"]
["B","Heating + Air Con","Fujitsu ","WET UFH","YES","40 °C","Room Temp","AC Unit"]
["B","Heating + Air Con","Fujitsu ","WET UFH","YES","40 °C","Room Temp","Wired Controller"]
["C","Heating + Air Con","Fujitsu ","ELECTRIC UFH","NO","N/A","Room Temp","Room Thimble Sensor"]
["C","Heating + Air Con","Fujitsu ","ELECTRIC UFH","NO","N/A","Room Temp","AC Unit"]
["C","Heating + Air Con","Fujitsu ","ELECTRIC UFH","NO","N/A","Room Temp","Wired Controller"]
["D","Heating + Air Con","Fujitsu ","ELECTRIC UFH","YES","TBA","Room Temp","Room Thimble Sensor"]
["D","Heating + Air Con","Fujitsu ","ELECTRIC UFH","YES","TBA","Room Temp","AC Unit"]
["D","Heating + Air Con","Fujitsu ","ELECTRIC UFH","YES","TBA","Room Temp","Wired Controller"]
["D","Heating + Air Con","Fujitsu ","ELECTRIC UFH","YES","25 °C","Room Temp","Room Thimble Sensor"]
["D","Heating + Air Con","Fujitsu ","ELECTRIC UFH","YES","25 °C","Room Temp","AC Unit"]
["D","Heating + Air Con","Fujitsu ","ELECTRIC UFH","YES","25 °C","Room Temp","Wired Controller"]
["D","Heating + Air Con","Fujitsu ","ELECTRIC UFH","YES","26 °C","Room Temp","Room Thimble Sensor"]
["D","Heating + Air Con","Fujitsu ","ELECTRIC UFH","YES","26 °C","Room Temp","AC Unit"]
["D","Heating + Air Con","Fujitsu ","ELECTRIC UFH","YES","26 °C","Room Temp","Wired Controller"]
["D","Heating + Air Con","Fujitsu ","ELECTRIC UFH","YES","27 °C","Room Temp","Room Thimble Sensor"]
["D","Heating + Air Con","Fujitsu ","ELECTRIC UFH","YES","27 °C","Room Temp","AC Unit"]
["D","Heating + Air Con","Fujitsu ","ELECTRIC UFH","YES","27 °C","Room Temp","Wired Controller"]
["D","Heating + Air Con","Fujitsu ","ELECTRIC UFH","YES","28 °C","Room Temp","Room Thimble Sensor"]
["D","Heating + Air Con","Fujitsu ","ELECTRIC UFH","YES","28 °C","Room Temp","AC Unit"]
["D","Heating + Air Con","Fujitsu ","ELECTRIC UFH","YES","28 °C","Room Temp","Wired Controller"]
["D","Heating + Air Con","Fujitsu ","ELECTRIC UFH","YES","29 °C","Room Temp","Room Thimble Sensor"]
["D","Heating + Air Con","Fujitsu ","ELECTRIC UFH","YES","29 °C","Room Temp","AC Unit"]
["D","Heating + Air Con","Fujitsu ","ELECTRIC UFH","YES","29 °C","Room Temp","Wired Controller"]
["D","Heating + Air Con","Fujitsu ","ELECTRIC UFH","YES","30 °C","Room Temp","Room Thimble Sensor"]
["D","Heating + Air Con","Fujitsu ","ELECTRIC UFH","YES","30 °C","Room Temp","AC Unit"]
["D","Heating + Air Con","Fujitsu ","ELECTRIC UFH","YES","30 °C","Room Temp","Wired Controller"]
["D","Heating + Air Con","Fujitsu ","ELECTRIC UFH","YES","31 °C","Room Temp","Room Thimble Sensor"]
["D","Heating + Air Con","Fujitsu ","ELECTRIC UFH","YES","31 °C","Room Temp","AC Unit"]
["D","Heating + Air Con","Fujitsu ","ELECTRIC UFH","YES","31 °C","Room Temp","Wired Controller"]
["D","Heating + Air Con","Fujitsu ","ELECTRIC UFH","YES","32 °C","Room Temp","Room Thimble Sensor"]
["D","Heating + Air Con","Fujitsu ","ELECTRIC UFH","YES","32 °C","Room Temp","AC Unit"]
["D","Heating + Air Con","Fujitsu ","ELECTRIC UFH","YES","32 °C","Room Temp","Wired Controller"]
["D","Heating + Air Con","Fujitsu ","ELECTRIC UFH","YES","33 °C","Room Temp","Room Thimble Sensor"]
["D","Heating + Air Con","Fujitsu ","ELECTRIC UFH","YES","33 °C","Room Temp","AC Unit"]
["D","Heating + Air Con","Fujitsu ","ELECTRIC UFH","YES","33 °C","Room Temp","Wired Controller"]
["D","Heating + Air Con","Fujitsu ","ELECTRIC UFH","YES","34 °C","Room Temp","Room Thimble Sensor"]
["D","Heating + Air Con","Fujitsu ","ELECTRIC UFH","YES","34 °C","Room Temp","AC Unit"]
["D","Heating + Air Con","Fujitsu ","ELECTRIC UFH","YES","34 °C","Room Temp","Wired Controller"]
["D","Heating + Air Con","Fujitsu ","ELECTRIC UFH","YES","35 °C","Room Temp","Room Thimble Sensor"]
["D","Heating + Air Con","Fujitsu ","ELECTRIC UFH","YES","35 °C","Room Temp","AC Unit"]
["D","Heating + Air Con","Fujitsu ","ELECTRIC UFH","YES","35 °C","Room Temp","Wired Controller"]
["D","Heating + Air Con","Fujitsu ","ELECTRIC UFH","YES","36 °C","Room Temp","Room Thimble Sensor"]
["D","Heating + Air Con","Fujitsu ","ELECTRIC UFH","YES","36 °C","Room Temp","AC Unit"]
["D","Heating + Air Con","Fujitsu ","ELECTRIC UFH","YES","36 °C","Room Temp","Wired Controller"]
["D","Heating + Air Con","Fujitsu ","ELECTRIC UFH","YES","37 °C","Room Temp","Room Thimble Sensor"]
["D","Heating + Air Con","Fujitsu ","ELECTRIC UFH","YES","37 °C","Room Temp","AC Unit"]
["D","Heating + Air Con","Fujitsu ","ELECTRIC UFH","YES","37 °C","Room Temp","Wired Controller"]
["D","Heating + Air Con","Fujitsu ","ELECTRIC UFH","YES","38 °C","Room Temp","Room Thimble Sensor"]
["D","Heating + Air Con","Fujitsu ","ELECTRIC UFH","YES","38 °C","Room Temp","AC Unit"]
["D","Heating + Air Con","Fujitsu ","ELECTRIC UFH","YES","38 °C","Room Temp","Wired Controller"]
["D","Heating + Air Con","Fujitsu ","ELECTRIC UFH","YES","39 °C","Room Temp","Room Thimble Sensor"]
["D","Heating + Air Con","Fujitsu ","ELECTRIC UFH","YES","39 °C","Room Temp","AC Unit"]
["D","Heating + Air Con","Fujitsu ","ELECTRIC UFH","YES","39 °C","Room Temp","Wired Controller"]
["D","Heating + Air Con","Fujitsu ","ELECTRIC UFH","YES","40 °C","Room Temp","Room Thimble Sensor"]
["D","Heating + Air Con","Fujitsu ","ELECTRIC UFH","YES","40 °C","Room Temp","AC Unit"]
["D","Heating + Air Con","Fujitsu ","ELECTRIC UFH","YES","40 °C","Room Temp","Wired Controller"]
["E","Heating + Air Con","Fujitsu ","RADIATOR","N/A","N/A","Room Temp","Room Thimble Sensor"]
["E","Heating + Air Con","Fujitsu ","RADIATOR","N/A","N/A","Room Temp","AC Unit"]
["E","Heating + Air Con","Fujitsu ","RADIATOR","N/A","N/A","Room Temp","Wired Controller"]
["A","Heating + Air Con","Hitachi ","WET UFH","NO","N/A","Room Temp","Room Thimble Sensor"]
["A","Heating + Air Con","Hitachi ","WET UFH","NO","N/A","Room Temp","AC Unit"]
["A","Heating + Air Con","Hitachi ","WET UFH","NO","N/A","Room Temp","Wired Controller"]
["B","Heating + Air Con","Hitachi ","WET UFH","YES","TBA","Room Temp","Room Thimble Sensor"]
["B","Heating + Air Con","Hitachi ","WET UFH","YES","TBA","Room Temp","AC Unit"]
["B","Heating + Air Con","Hitachi ","WET UFH","YES","TBA","Room Temp","Wired Controller"]
["B","Heating + Air Con","Hitachi ","WET UFH","YES","25 °C","Room Temp","Room Thimble Sensor"]
["B","Heating + Air Con","Hitachi ","WET UFH","YES","25 °C","Room Temp","AC Unit"]
["B","Heating + Air Con","Hitachi ","WET UFH","YES","25 °C","Room Temp","Wired Controller"]
["B","Heating + Air Con","Hitachi ","WET UFH","YES","26 °C","Room Temp","Room Thimble Sensor"]
["B","Heating + Air Con","Hitachi ","WET UFH","YES","26 °C","Room Temp","AC Unit"]
["B","Heating + Air Con","Hitachi ","WET UFH","YES","26 °C","Room Temp","Wired Controller"]
["B","Heating + Air Con","Hitachi ","WET UFH","YES","27 °C","Room Temp","Room Thimble Sensor"]
["B","Heating + Air Con","Hitachi ","WET UFH","YES","27 °C","Room Temp","AC Unit"]
["B","Heating + Air Con","Hitachi ","WET UFH","YES","27 °C","Room Temp","Wired Controller"]
["B","Heating + Air Con","Hitachi ","WET UFH","YES","28 °C","Room Temp","Room Thimble Sensor"]
["B","Heating + Air Con","Hitachi ","WET UFH","YES","28 °C","Room Temp","AC Unit"]
["B","Heating + Air Con","Hitachi ","WET UFH","YES","28 °C","Room Temp","Wired Controller"]
["B","Heating + Air Con","Hitachi ","WET UFH","YES","29 °C","Room Temp","Room Thimble Sensor"]
["B","Heating + Air Con","Hitachi ","WET UFH","YES","29 °C","Room Temp","AC Unit"]
["B","Heating + Air Con","Hitachi ","WET UFH","YES","29 °C","Room Temp","Wired Controller"]
["B","Heating + Air Con","Hitachi ","WET UFH","YES","30 °C","Room Temp","Room Thimble Sensor"]
["B","Heating + Air Con","Hitachi ","WET UFH","YES","30 °C","Room Temp","AC Unit"]
["B","Heating + Air Con","Hitachi ","WET UFH","YES","30 °C","Room Temp","Wired Controller"]
["B","Heating + Air Con","Hitachi ","WET UFH","YES","31 °C","Room Temp","Room Thimble Sensor"]
["B","Heating + Air Con","Hitachi ","WET UFH","YES","31 °C","Room Temp","AC Unit"]
["B","Heating + Air Con","Hitachi ","WET UFH","YES","31 °C","Room Temp","Wired Controller"]
["B","Heating + Air Con","Hitachi ","WET UFH","YES","32 °C","Room Temp","Room Thimble Sensor"]
["B","Heating + Air Con","Hitachi ","WET UFH","YES","32 °C","Room Temp","AC Unit"]
["B","Heating + Air Con","Hitachi ","WET UFH","YES","32 °C","Room Temp","Wired Controller"]
["B","Heating + Air Con","Hitachi ","WET UFH","YES","33 °C","Room Temp","Room Thimble Sensor"]
["B","Heating + Air Con","Hitachi ","WET UFH","YES","33 °C","Room Temp","AC Unit"]
["B","Heating + Air Con","Hitachi ","WET UFH","YES","33 °C","Room Temp","Wired Controller"]
["B","Heating + Air Con","Hitachi ","WET UFH","YES","34 °C","Room Temp","Room Thimble Sensor"]
["B","Heating + Air Con","Hitachi ","WET UFH","YES","34 °C","Room Temp","AC Unit"]
["B","Heating + Air Con","Hitachi ","WET UFH","YES","34 °C","Room Temp","Wired Controller"]
["B","Heating + Air Con","Hitachi ","WET UFH","YES","35 °C","Room Temp","Room Thimble Sensor"]
["B","Heating + Air Con","Hitachi ","WET UFH","YES","35 °C","Room Temp","AC Unit"]
["B","Heating + Air Con","Hitachi ","WET UFH","YES","35 °C","Room Temp","Wired Controller"]
["B","Heating + Air Con","Hitachi ","WET UFH","YES","36 °C","Room Temp","Room Thimble Sensor"]
["B","Heating + Air Con","Hitachi ","WET UFH","YES","36 °C","Room Temp","AC Unit"]
["B","Heating + Air Con","Hitachi ","WET UFH","YES","36 °C","Room Temp","Wired Controller"]
["B","Heating + Air Con","Hitachi ","WET UFH","YES","37 °C","Room Temp","Room Thimble Sensor"]
["B","Heating + Air Con","Hitachi ","WET UFH","YES","37 °C","Room Temp","AC Unit"]
["B","Heating + Air Con","Hitachi ","WET UFH","YES","37 °C","Room Temp","Wired Controller"]
["B","Heating + Air Con","Hitachi ","WET UFH","YES","38 °C","Room Temp","Room Thimble Sensor"]
["B","Heating + Air Con","Hitachi ","WET UFH","YES","38 °C","Room Temp","AC Unit"]
["B","Heating + Air Con","Hitachi ","WET UFH","YES","38 °C","Room Temp","Wired Controller"]
["B","Heating + Air Con","Hitachi ","WET UFH","YES","39 °C","Room Temp","Room Thimble Sensor"]
["B","Heating + Air Con","Hitachi ","WET UFH","YES","39 °C","Room Temp","AC Unit"]
["B","Heating + Air Con","Hitachi ","WET UFH","YES","39 °C","Room Temp","Wired Controller"]
["B","Heating + Air Con","Hitachi ","WET UFH","YES","40 °C","Room Temp","Room Thimble Sensor"]
["B","Heating + Air Con","Hitachi ","WET UFH","YES","40 °C","Room Temp","AC Unit"]
["B","Heating + Air Con","Hitachi ","WET UFH","YES","40 °C","Room Temp","Wired Controller"]
["C","Heating + Air Con","Hitachi ","ELECTRIC UFH","NO","N/A","Room Temp","Room Thimble Sensor"]
["C","Heating + Air Con","Hitachi ","ELECTRIC UFH","NO","N/A","Room Temp","AC Unit"]
["C","Heating + Air Con","Hitachi ","ELECTRIC UFH","NO","N/A","Room Temp","Wired Controller"]
["D","Heating + Air Con","Hitachi ","ELECTRIC UFH","YES","TBA","Room Temp","Room Thimble Sensor"]
["D","Heating + Air Con","Hitachi ","ELECTRIC UFH","YES","TBA","Room Temp","AC Unit"]
["D","Heating + Air Con","Hitachi ","ELECTRIC UFH","YES","TBA","Room Temp","Wired Controller"]
["D","Heating + Air Con","Hitachi ","ELECTRIC UFH","YES","25 °C","Room Temp","Room Thimble Sensor"]
["D","Heating + Air Con","Hitachi ","ELECTRIC UFH","YES","25 °C","Room Temp","AC Unit"]
["D","Heating + Air Con","Hitachi ","ELECTRIC UFH","YES","25 °C","Room Temp","Wired Controller"]
["D","Heating + Air Con","Hitachi ","ELECTRIC UFH","YES","26 °C","Room Temp","Room Thimble Sensor"]
["D","Heating + Air Con","Hitachi ","ELECTRIC UFH","YES","26 °C","Room Temp","AC Unit"]
["D","Heating + Air Con","Hitachi ","ELECTRIC UFH","YES","26 °C","Room Temp","Wired Controller"]
["D","Heating + Air Con","Hitachi ","ELECTRIC UFH","YES","27 °C","Room Temp","Room Thimble Sensor"]
["D","Heating + Air Con","Hitachi ","ELECTRIC UFH","YES","27 °C","Room Temp","AC Unit"]
["D","Heating + Air Con","Hitachi ","ELECTRIC UFH","YES","27 °C","Room Temp","Wired Controller"]
["D","Heating + Air Con","Hitachi ","ELECTRIC UFH","YES","28 °C","Room Temp","Room Thimble Sensor"]
["D","Heating + Air Con","Hitachi ","ELECTRIC UFH","YES","28 °C","Room Temp","AC Unit"]
["D","Heating + Air Con","Hitachi ","ELECTRIC UFH","YES","28 °C","Room Temp","Wired Controller"]
["D","Heating + Air Con","Hitachi ","ELECTRIC UFH","YES","29 °C","Room Temp","Room Thimble Sensor"]
["D","Heating + Air Con","Hitachi ","ELECTRIC UFH","YES","29 °C","Room Temp","AC Unit"]
["D","Heating + Air Con","Hitachi ","ELECTRIC UFH","YES","29 °C","Room Temp","Wired Controller"]
["D","Heating + Air Con","Hitachi ","ELECTRIC UFH","YES","30 °C","Room Temp","Room Thimble Sensor"]
["D","Heating + Air Con","Hitachi ","ELECTRIC UFH","YES","30 °C","Room Temp","AC Unit"]
["D","Heating + Air Con","Hitachi ","ELECTRIC UFH","YES","30 °C","Room Temp","Wired Controller"]
["D","Heating + Air Con","Hitachi ","ELECTRIC UFH","YES","31 °C","Room Temp","Room Thimble Sensor"]
["D","Heating + Air Con","Hitachi ","ELECTRIC UFH","YES","31 °C","Room Temp","AC Unit"]
["D","Heating + Air Con","Hitachi ","ELECTRIC UFH","YES","31 °C","Room Temp","Wired Controller"]
["D","Heating + Air Con","Hitachi ","ELECTRIC UFH","YES","32 °C","Room Temp","Room Thimble Sensor"]
["D","Heating + Air Con","Hitachi ","ELECTRIC UFH","YES","32 °C","Room Temp","AC Unit"]
["D","Heating + Air Con","Hitachi ","ELECTRIC UFH","YES","32 °C","Room Temp","Wired Controller"]
["D","Heating + Air Con","Hitachi ","ELECTRIC UFH","YES","33 °C","Room Temp","Room Thimble Sensor"]
["D","Heating + Air Con","Hitachi ","ELECTRIC UFH","YES","33 °C","Room Temp","AC Unit"]
["D","Heating + Air Con","Hitachi ","ELECTRIC UFH","YES","33 °C","Room Temp","Wired Controller"]
["D","Heating + Air Con","Hitachi ","ELECTRIC UFH","YES","34 °C","Room Temp","Room Thimble Sensor"]
["D","Heating + Air Con","Hitachi ","ELECTRIC UFH","YES","34 °C","Room Temp","AC Unit"]
["D","Heating + Air Con","Hitachi ","ELECTRIC UFH","YES","34 °C","Room Temp","Wired Controller"]
["D","Heating + Air Con","Hitachi ","ELECTRIC UFH","YES","35 °C","Room Temp","Room Thimble Sensor"]
["D","Heating + Air Con","Hitachi ","ELECTRIC UFH","YES","35 °C","Room Temp","AC Unit"]
["D","Heating + Air Con","Hitachi ","ELECTRIC UFH","YES","35 °C","Room Temp","Wired Controller"]
["D","Heating + Air Con","Hitachi ","ELECTRIC UFH","YES","36 °C","Room Temp","Room Thimble Sensor"]
["D","Heating + Air Con","Hitachi ","ELECTRIC UFH","YES","36 °C","Room Temp","AC Unit"]
["D","Heating + Air Con","Hitachi ","ELECTRIC UFH","YES","36 °C","Room Temp","Wired Controller"]
["D","Heating + Air Con","Hitachi ","ELECTRIC UFH","YES","37 °C","Room Temp","Room Thimble Sensor"]
["D","Heating + Air Con","Hitachi ","ELECTRIC UFH","YES","37 °C","Room Temp","AC Unit"]
["D","Heating + Air Con","Hitachi ","ELECTRIC UFH","YES","37 °C","Room Temp","Wired Controller"]
["D","Heating + Air Con","Hitachi ","ELECTRIC UFH","YES","38 °C","Room Temp","Room Thimble Sensor"]
["D","Heating + Air Con","Hitachi ","ELECTRIC UFH","YES","38 °C","Room Temp","AC Unit"]
["D","Heating + Air Con","Hitachi ","ELECTRIC UFH","YES","38 °C","Room Temp","Wired Controller"]
["D","Heating + Air Con","Hitachi ","ELECTRIC UFH","YES","39 °C","Room Temp","Room Thimble Sensor"]
["D","Heating + Air Con","Hitachi ","ELECTRIC UFH","YES","39 °C","Room Temp","AC Unit"]
["D","Heating + Air Con","Hitachi ","ELECTRIC UFH","YES","39 °C","Room Temp","Wired Controller"]
["D","Heating + Air Con","Hitachi ","ELECTRIC UFH","YES","40 °C","Room Temp","Room Thimble Sensor"]
["D","Heating + Air Con","Hitachi ","ELECTRIC UFH","YES","40 °C","Room Temp","AC Unit"]
["D","Heating + Air Con","Hitachi ","ELECTRIC UFH","YES","40 °C","Room Temp","Wired Controller"]
["E","Heating + Air Con","Hitachi ","RADIATOR","N/A","N/A","Room Temp","Room Thimble Sensor"]
["E","Heating + Air Con","Hitachi ","RADIATOR","N/A","N/A","Room Temp","AC Unit"]
["E","Heating + Air Con","Hitachi ","RADIATOR","N/A","N/A","Room Temp","Wired Controller"]
["A","Heating + Air Con","LG","WET UFH","NO","N/A","Room Temp","Room Thimble Sensor"]
["A","Heating + Air Con","LG","WET UFH","NO","N/A","Room Temp","AC Unit"]
["A","Heating + Air Con","LG","WET UFH","NO","N/A","Room Temp","Wired Controller"]
["B","Heating + Air Con","LG","WET UFH","YES","TBA","Room Temp","Room Thimble Sensor"]
["B","Heating + Air Con","LG","WET UFH","YES","TBA","Room Temp","AC Unit"]
["B","Heating + Air Con","LG","WET UFH","YES","TBA","Room Temp","Wired Controller"]
["B","Heating + Air Con","LG","WET UFH","YES","25 °C","Room Temp","Room Thimble Sensor"]
["B","Heating + Air Con","LG","WET UFH","YES","25 °C","Room Temp","AC Unit"]
["B","Heating + Air Con","LG","WET UFH","YES","25 °C","Room Temp","Wired Controller"]
["B","Heating + Air Con","LG","WET UFH","YES","26 °C","Room Temp","Room Thimble Sensor"]
["B","Heating + Air Con","LG","WET UFH","YES","26 °C","Room Temp","AC Unit"]
["B","Heating + Air Con","LG","WET UFH","YES","26 °C","Room Temp","Wired Controller"]
["B","Heating + Air Con","LG","WET UFH","YES","27 °C","Room Temp","Room Thimble Sensor"]
["B","Heating + Air Con","LG","WET UFH","YES","27 °C","Room Temp","AC Unit"]
["B","Heating + Air Con","LG","WET UFH","YES","27 °C","Room Temp","Wired Controller"]
["B","Heating + Air Con","LG","WET UFH","YES","28 °C","Room Temp","Room Thimble Sensor"]
["B","Heating + Air Con","LG","WET UFH","YES","28 °C","Room Temp","AC Unit"]
["B","Heating + Air Con","LG","WET UFH","YES","28 °C","Room Temp","Wired Controller"]
["B","Heating + Air Con","LG","WET UFH","YES","29 °C","Room Temp","Room Thimble Sensor"]
["B","Heating + Air Con","LG","WET UFH","YES","29 °C","Room Temp","AC Unit"]
["B","Heating + Air Con","LG","WET UFH","YES","29 °C","Room Temp","Wired Controller"]
["B","Heating + Air Con","LG","WET UFH","YES","30 °C","Room Temp","Room Thimble Sensor"]
["B","Heating + Air Con","LG","WET UFH","YES","30 °C","Room Temp","AC Unit"]
["B","Heating + Air Con","LG","WET UFH","YES","30 °C","Room Temp","Wired Controller"]
["B","Heating + Air Con","LG","WET UFH","YES","31 °C","Room Temp","Room Thimble Sensor"]
["B","Heating + Air Con","LG","WET UFH","YES","31 °C","Room Temp","AC Unit"]
["B","Heating + Air Con","LG","WET UFH","YES","31 °C","Room Temp","Wired Controller"]
["B","Heating + Air Con","LG","WET UFH","YES","32 °C","Room Temp","Room Thimble Sensor"]
["B","Heating + Air Con","LG","WET UFH","YES","32 °C","Room Temp","AC Unit"]
["B","Heating + Air Con","LG","WET UFH","YES","32 °C","Room Temp","Wired Controller"]
["B","Heating + Air Con","LG","WET UFH","YES","33 °C","Room Temp","Room Thimble Sensor"]
["B","Heating + Air Con","LG","WET UFH","YES","33 °C","Room Temp","AC Unit"]
["B","Heating + Air Con","LG","WET UFH","YES","33 °C","Room Temp","Wired Controller"]
["B","Heating + Air Con","LG","WET UFH","YES","34 °C","Room Temp","Room Thimble Sensor"]
["B","Heating + Air Con","LG","WET UFH","YES","34 °C","Room Temp","AC Unit"]
["B","Heating + Air Con","LG","WET UFH","YES","34 °C","Room Temp","Wired Controller"]
["B","Heating + Air Con","LG","WET UFH","YES","35 °C","Room Temp","Room Thimble Sensor"]
["B","Heating + Air Con","LG","WET UFH","YES","35 °C","Room Temp","AC Unit"]
["B","Heating + Air Con","LG","WET UFH","YES","35 °C","Room Temp","Wired Controller"]
["B","Heating + Air Con","LG","WET UFH","YES","36 °C","Room Temp","Room Thimble Sensor"]
["B","Heating + Air Con","LG","WET UFH","YES","36 °C","Room Temp","AC Unit"]
["B","Heating + Air Con","LG","WET UFH","YES","36 °C","Room Temp","Wired Controller"]
["B","Heating + Air Con","LG","WET UFH","YES","37 °C","Room Temp","Room Thimble Sensor"]
["B","Heating + Air Con","LG","WET UFH","YES","37 °C","Room Temp","AC Unit"]
["B","Heating + Air Con","LG","WET UFH","YES","37 °C","Room Temp","Wired Controller"]
["B","Heating + Air Con","LG","WET UFH","YES","38 °C","Room Temp","Room Thimble Sensor"]
["B","Heating + Air Con","LG","WET UFH","YES","38 °C","Room Temp","AC Unit"]
["B","Heating + Air Con","LG","WET UFH","YES","38 °C","Room Temp","Wired Controller"]
["B","Heating + Air Con","LG","WET UFH","YES","39 °C","Room Temp","Room Thimble Sensor"]
["B","Heating + Air Con","LG","WET UFH","YES","39 °C","Room Temp","AC Unit"]
["B","Heating + Air Con","LG","WET UFH","YES","39 °C","Room Temp","Wired Controller"]
["B","Heating + Air Con","LG","WET UFH","YES","40 °C","Room Temp","Room Thimble Sensor"]
["B","Heating + Air Con","LG","WET UFH","YES","40 °C","Room Temp","AC Unit"]
["B","Heating + Air Con","LG","WET UFH","YES","40 °C","Room Temp","Wired Controller"]
["C","Heating + Air Con","LG","ELECTRIC UFH","NO","N/A","Room Temp","Room Thimble Sensor"]
["C","Heating + Air Con","LG","ELECTRIC UFH","NO","N/A","Room Temp","AC Unit"]
["C","Heating + Air Con","LG","ELECTRIC UFH","NO","N/A","Room Temp","Wired Controller"]
["D","Heating + Air Con","LG","ELECTRIC UFH","YES","TBA","Room Temp","Room Thimble Sensor"]
["D","Heating + Air Con","LG","ELECTRIC UFH","YES","TBA","Room Temp","AC Unit"]
["D","Heating + Air Con","LG","ELECTRIC UFH","YES","TBA","Room Temp","Wired Controller"]
["D","Heating + Air Con","LG","ELECTRIC UFH","YES","25 °C","Room Temp","Room Thimble Sensor"]
["D","Heating + Air Con","LG","ELECTRIC UFH","YES","25 °C","Room Temp","AC Unit"]
["D","Heating + Air Con","LG","ELECTRIC UFH","YES","25 °C","Room Temp","Wired Controller"]
["D","Heating + Air Con","LG","ELECTRIC UFH","YES","26 °C","Room Temp","Room Thimble Sensor"]
["D","Heating + Air Con","LG","ELECTRIC UFH","YES","26 °C","Room Temp","AC Unit"]
["D","Heating + Air Con","LG","ELECTRIC UFH","YES","26 °C","Room Temp","Wired Controller"]
["D","Heating + Air Con","LG","ELECTRIC UFH","YES","27 °C","Room Temp","Room Thimble Sensor"]
["D","Heating + Air Con","LG","ELECTRIC UFH","YES","27 °C","Room Temp","AC Unit"]
["D","Heating + Air Con","LG","ELECTRIC UFH","YES","27 °C","Room Temp","Wired Controller"]
["D","Heating + Air Con","LG","ELECTRIC UFH","YES","28 °C","Room Temp","Room Thimble Sensor"]
["D","Heating + Air Con","LG","ELECTRIC UFH","YES","28 °C","Room Temp","AC Unit"]
["D","Heating + Air Con","LG","ELECTRIC UFH","YES","28 °C","Room Temp","Wired Controller"]
["D","Heating + Air Con","LG","ELECTRIC UFH","YES","29 °C","Room Temp","Room Thimble Sensor"]
["D","Heating + Air Con","LG","ELECTRIC UFH","YES","29 °C","Room Temp","AC Unit"]
["D","Heating + Air Con","LG","ELECTRIC UFH","YES","29 °C","Room Temp","Wired Controller"]
["D","Heating + Air Con","LG","ELECTRIC UFH","YES","30 °C","Room Temp","Room Thimble Sensor"]
["D","Heating + Air Con","LG","ELECTRIC UFH","YES","30 °C","Room Temp","AC Unit"]
["D","Heating + Air Con","LG","ELECTRIC UFH","YES","30 °C","Room Temp","Wired Controller"]
["D","Heating + Air Con","LG","ELECTRIC UFH","YES","31 °C","Room Temp","Room Thimble Sensor"]
["D","Heating + Air Con","LG","ELECTRIC UFH","YES","31 °C","Room Temp","AC Unit"]
["D","Heating + Air Con","LG","ELECTRIC UFH","YES","31 °C","Room Temp","Wired Controller"]
["D","Heating + Air Con","LG","ELECTRIC UFH","YES","32 °C","Room Temp","Room Thimble Sensor"]
["D","Heating + Air Con","LG","ELECTRIC UFH","YES","32 °C","Room Temp","AC Unit"]
["D","Heating + Air Con","LG","ELECTRIC UFH","YES","32 °C","Room Temp","Wired Controller"]
["D","Heating + Air Con","LG","ELECTRIC UFH","YES","33 °C","Room Temp","Room Thimble Sensor"]
["D","Heating + Air Con","LG","ELECTRIC UFH","YES","33 °C","Room Temp","AC Unit"]
["D","Heating + Air Con","LG","ELECTRIC UFH","YES","33 °C","Room Temp","Wired Controller"]
["D","Heating + Air Con","LG","ELECTRIC UFH","YES","34 °C","Room Temp","Room Thimble Sensor"]
["D","Heating + Air Con","LG","ELECTRIC UFH","YES","34 °C","Room Temp","AC Unit"]
["D","Heating + Air Con","LG","ELECTRIC UFH","YES","34 °C","Room Temp","Wired Controller"]
["D","Heating + Air Con","LG","ELECTRIC UFH","YES","35 °C","Room Temp","Room Thimble Sensor"]
["D","Heating + Air Con","LG","ELECTRIC UFH","YES","35 °C","Room Temp","AC Unit"]
["D","Heating + Air Con","LG","ELECTRIC UFH","YES","35 °C","Room Temp","Wired Controller"]
["D","Heating + Air Con","LG","ELECTRIC UFH","YES","36 °C","Room Temp","Room Thimble Sensor"]
["D","Heating + Air Con","LG","ELECTRIC UFH","YES","36 °C","Room Temp","AC Unit"]
["D","Heating + Air Con","LG","ELECTRIC UFH","YES","36 °C","Room Temp","Wired Controller"]
["D","Heating + Air Con","LG","ELECTRIC UFH","YES","37 °C","Room Temp","Room Thimble Sensor"]
["D","Heating + Air Con","LG","ELECTRIC UFH","YES","37 °C","Room Temp","AC Unit"]
["D","Heating + Air Con","LG","ELECTRIC UFH","YES","37 °C","Room Temp","Wired Controller"]
["D","Heating + Air Con","LG","ELECTRIC UFH","YES","38 °C","Room Temp","Room Thimble Sensor"]
["D","Heating + Air Con","LG","ELECTRIC UFH","YES","38 °C","Room Temp","AC Unit"]
["D","Heating + Air Con","LG","ELECTRIC UFH","YES","38 °C","Room Temp","Wired Controller"]
["D","Heating + Air Con","LG","ELECTRIC UFH","YES","39 °C","Room Temp","Room Thimble Sensor"]
["D","Heating + Air Con","LG","ELECTRIC UFH","YES","39 °C","Room Temp","AC Unit"]
["D","Heating + Air Con","LG","ELECTRIC UFH","YES","39 °C","Room Temp","Wired Controller"]
["D","Heating + Air Con","LG","ELECTRIC UFH","YES","40 °C","Room Temp","Room Thimble Sensor"]
["D","Heating + Air Con","LG","ELECTRIC UFH","YES","40 °C","Room Temp","AC Unit"]
["D","Heating + Air Con","LG","ELECTRIC UFH","YES","40 °C","Room Temp","Wired Controller"]
["E","Heating + Air Con","LG","RADIATOR","N/A","N/A","Room Temp","Room Thimble Sensor"]
["E","Heating + Air Con","LG","RADIATOR","N/A","N/A","Room Temp","AC Unit"]
["E","Heating + Air Con","LG","RADIATOR","N/A","N/A","Room Temp","Wired Controller"]
["A","Heating + Air Con","Other","WET UFH","NO","N/A","Room Temp","Room Thimble Sensor"]
["A","Heating + Air Con","Other","WET UFH","NO","N/A","Room Temp","AC Unit"]
["A","Heating + Air Con","Other","WET UFH","NO","N/A","Room Temp","Wired Controller"]
["B","Heating + Air Con","Other","WET UFH","YES","TBA","Room Temp","Room Thimble Sensor"]
["B","Heating + Air Con","Other","WET UFH","YES","TBA","Room Temp","AC Unit"]
["B","Heating + Air Con","Other","WET UFH","YES","TBA","Room Temp","Wired Controller"]
["B","Heating + Air Con","Other","WET UFH","YES","25 °C","Room Temp","Room Thimble Sensor"]
["B","Heating + Air Con","Other","WET UFH","YES","25 °C","Room Temp","AC Unit"]
["B","Heating + Air Con","Other","WET UFH","YES","25 °C","Room Temp","Wired Controller"]
["B","Heating + Air Con","Other","WET UFH","YES","26 °C","Room Temp","Room Thimble Sensor"]
["B","Heating + Air Con","Other","WET UFH","YES","26 °C","Room Temp","AC Unit"]
["B","Heating + Air Con","Other","WET UFH","YES","26 °C","Room Temp","Wired Controller"]
["B","Heating + Air Con","Other","WET UFH","YES","27 °C","Room Temp","Room Thimble Sensor"]
["B","Heating + Air Con","Other","WET UFH","YES","27 °C","Room Temp","AC Unit"]
["B","Heating + Air Con","Other","WET UFH","YES","27 °C","Room Temp","Wired Controller"]
["B","Heating + Air Con","Other","WET UFH","YES","28 °C","Room Temp","Room Thimble Sensor"]
["B","Heating + Air Con","Other","WET UFH","YES","28 °C","Room Temp","AC Unit"]
["B","Heating + Air Con","Other","WET UFH","YES","28 °C","Room Temp","Wired Controller"]
["B","Heating + Air Con","Other","WET UFH","YES","29 °C","Room Temp","Room Thimble Sensor"]
["B","Heating + Air Con","Other","WET UFH","YES","29 °C","Room Temp","AC Unit"]
["B","Heating + Air Con","Other","WET UFH","YES","29 °C","Room Temp","Wired Controller"]
["B","Heating + Air Con","Other","WET UFH","YES","30 °C","Room Temp","Room Thimble Sensor"]
["B","Heating + Air Con","Other","WET UFH","YES","30 °C","Room Temp","AC Unit"]
["B","Heating + Air Con","Other","WET UFH","YES","30 °C","Room Temp","Wired Controller"]
["B","Heating + Air Con","Other","WET UFH","YES","31 °C","Room Temp","Room Thimble Sensor"]
["B","Heating + Air Con","Other","WET UFH","YES","31 °C","Room Temp","AC Unit"]
["B","Heating + Air Con","Other","WET UFH","YES","31 °C","Room Temp","Wired Controller"]
["B","Heating + Air Con","Other","WET UFH","YES","32 °C","Room Temp","Room Thimble Sensor"]
["B","Heating + Air Con","Other","WET UFH","YES","32 °C","Room Temp","AC Unit"]
["B","Heating + Air Con","Other","WET UFH","YES","32 °C","Room Temp","Wired Controller"]
["B","Heating + Air Con","Other","WET UFH","YES","33 °C","Room Temp","Room Thimble Sensor"]
["B","Heating + Air Con","Other","WET UFH","YES","33 °C","Room Temp","AC Unit"]
["B","Heating + Air Con","Other","WET UFH","YES","33 °C","Room Temp","Wired Controller"]
["B","Heating + Air Con","Other","WET UFH","YES","34 °C","Room Temp","Room Thimble Sensor"]
["B","Heating + Air Con","Other","WET UFH","YES","34 °C","Room Temp","AC Unit"]
["B","Heating + Air Con","Other","WET UFH","YES","34 °C","Room Temp","Wired Controller"]
["B","Heating + Air Con","Other","WET UFH","YES","35 °C","Room Temp","Room Thimble Sensor"]
["B","Heating + Air Con","Other","WET UFH","YES","35 °C","Room Temp","AC Unit"]
["B","Heating + Air Con","Other","WET UFH","YES","35 °C","Room Temp","Wired Controller"]
["B","Heating + Air Con","Other","WET UFH","YES","36 °C","Room Temp","Room Thimble Sensor"]
["B","Heating + Air Con","Other","WET UFH","YES","36 °C","Room Temp","AC Unit"]
["B","Heating + Air Con","Other","WET UFH","YES","36 °C","Room Temp","Wired Controller"]
["B","Heating + Air Con","Other","WET UFH","YES","37 °C","Room Temp","Room Thimble Sensor"]
["B","Heating + Air Con","Other","WET UFH","YES","37 °C","Room Temp","AC Unit"]
["B","Heating + Air Con","Other","WET UFH","YES","37 °C","Room Temp","Wired Controller"]
["B","Heating + Air Con","Other","WET UFH","YES","38 °C","Room Temp","Room Thimble Sensor"]
["B","Heating + Air Con","Other","WET UFH","YES","38 °C","Room Temp","AC Unit"]
["B","Heating + Air Con","Other","WET UFH","YES","38 °C","Room Temp","Wired Controller"]
["B","Heating + Air Con","Other","WET UFH","YES","39 °C","Room Temp","Room Thimble Sensor"]
["B","Heating + Air Con","Other","WET UFH","YES","39 °C","Room Temp","AC Unit"]
["B","Heating + Air Con","Other","WET UFH","YES","39 °C","Room Temp","Wired Controller"]
["B","Heating + Air Con","Other","WET UFH","YES","40 °C","Room Temp","Room Thimble Sensor"]
["B","Heating + Air Con","Other","WET UFH","YES","40 °C","Room Temp","AC Unit"]
["B","Heating + Air Con","Other","WET UFH","YES","40 °C","Room Temp","Wired Controller"]
["C","Heating + Air Con","Other","ELECTRIC UFH","NO","N/A","Room Temp","Room Thimble Sensor"]
["C","Heating + Air Con","Other","ELECTRIC UFH","NO","N/A","Room Temp","AC Unit"]
["C","Heating + Air Con","Other","ELECTRIC UFH","NO","N/A","Room Temp","Wired Controller"]
["D","Heating + Air Con","Other","ELECTRIC UFH","YES","TBA","Room Temp","Room Thimble Sensor"]
["D","Heating + Air Con","Other","ELECTRIC UFH","YES","TBA","Room Temp","AC Unit"]
["D","Heating + Air Con","Other","ELECTRIC UFH","YES","TBA","Room Temp","Wired Controller"]
["D","Heating + Air Con","Other","ELECTRIC UFH","YES","25 °C","Room Temp","Room Thimble Sensor"]
["D","Heating + Air Con","Other","ELECTRIC UFH","YES","25 °C","Room Temp","AC Unit"]
["D","Heating + Air Con","Other","ELECTRIC UFH","YES","25 °C","Room Temp","Wired Controller"]
["D","Heating + Air Con","Other","ELECTRIC UFH","YES","26 °C","Room Temp","Room Thimble Sensor"]
["D","Heating + Air Con","Other","ELECTRIC UFH","YES","26 °C","Room Temp","AC Unit"]
["D","Heating + Air Con","Other","ELECTRIC UFH","YES","26 °C","Room Temp","Wired Controller"]
["D","Heating + Air Con","Other","ELECTRIC UFH","YES","27 °C","Room Temp","Room Thimble Sensor"]
["D","Heating + Air Con","Other","ELECTRIC UFH","YES","27 °C","Room Temp","AC Unit"]
["D","Heating + Air Con","Other","ELECTRIC UFH","YES","27 °C","Room Temp","Wired Controller"]
["D","Heating + Air Con","Other","ELECTRIC UFH","YES","28 °C","Room Temp","Room Thimble Sensor"]
["D","Heating + Air Con","Other","ELECTRIC UFH","YES","28 °C","Room Temp","AC Unit"]
["D","Heating + Air Con","Other","ELECTRIC UFH","YES","28 °C","Room Temp","Wired Controller"]
["D","Heating + Air Con","Other","ELECTRIC UFH","YES","29 °C","Room Temp","Room Thimble Sensor"]
["D","Heating + Air Con","Other","ELECTRIC UFH","YES","29 °C","Room Temp","AC Unit"]
["D","Heating + Air Con","Other","ELECTRIC UFH","YES","29 °C","Room Temp","Wired Controller"]
["D","Heating + Air Con","Other","ELECTRIC UFH","YES","30 °C","Room Temp","Room Thimble Sensor"]
["D","Heating + Air Con","Other","ELECTRIC UFH","YES","30 °C","Room Temp","AC Unit"]
["D","Heating + Air Con","Other","ELECTRIC UFH","YES","30 °C","Room Temp","Wired Controller"]
["D","Heating + Air Con","Other","ELECTRIC UFH","YES","31 °C","Room Temp","Room Thimble Sensor"]
["D","Heating + Air Con","Other","ELECTRIC UFH","YES","31 °C","Room Temp","AC Unit"]
["D","Heating + Air Con","Other","ELECTRIC UFH","YES","31 °C","Room Temp","Wired Controller"]
["D","Heating + Air Con","Other","ELECTRIC UFH","YES","32 °C","Room Temp","Room Thimble Sensor"]
["D","Heating + Air Con","Other","ELECTRIC UFH","YES","32 °C","Room Temp","AC Unit"]
["D","Heating + Air Con","Other","ELECTRIC UFH","YES","32 °C","Room Temp","Wired Controller"]
["D","Heating + Air Con","Other","ELECTRIC UFH","YES","33 °C","Room Temp","Room Thimble Sensor"]
["D","Heating + Air Con","Other","ELECTRIC UFH","YES","33 °C","Room Temp","AC Unit"]
["D","Heating + Air Con","Other","ELECTRIC UFH","YES","33 °C","Room Temp","Wired Controller"]
["D","Heating + Air Con","Other","ELECTRIC UFH","YES","34 °C","Room Temp","Room Thimble Sensor"]
["D","Heating + Air Con","Other","ELECTRIC UFH","YES","34 °C","Room Temp","AC Unit"]
["D","Heating + Air Con","Other","ELECTRIC UFH","YES","34 °C","Room Temp","Wired Controller"]
["D","Heating + Air Con","Other","ELECTRIC UFH","YES","35 °C","Room Temp","Room Thimble Sensor"]
["D","Heating + Air Con","Other","ELECTRIC UFH","YES","35 °C","Room Temp","AC Unit"]
["D","Heating + Air Con","Other","ELECTRIC UFH","YES","35 °C","Room Temp","Wired Controller"]
["D","Heating + Air Con","Other","ELECTRIC UFH","YES","36 °C","Room Temp","Room Thimble Sensor"]
["D","Heating + Air Con","Other","ELECTRIC UFH","YES","36 °C","Room Temp","AC Unit"]
["D","Heating + Air Con","Other","ELECTRIC UFH","YES","36 °C","Room Temp","Wired Controller"]
["D","Heating + Air Con","Other","ELECTRIC UFH","YES","37 °C","Room Temp","Room Thimble Sensor"]
["D","Heating + Air Con","Other","ELECTRIC UFH","YES","37 °C","Room Temp","AC Unit"]
["D","Heating + Air Con","Other","ELECTRIC UFH","YES","37 °C","Room Temp","Wired Controller"]
["D","Heating + Air Con","Other","ELECTRIC UFH","YES","38 °C","Room Temp","Room Thimble Sensor"]
["D","Heating + Air Con","Other","ELECTRIC UFH","YES","38 °C","Room Temp","AC Unit"]
["D","Heating + Air Con","Other","ELECTRIC UFH","YES","38 °C","Room Temp","Wired Controller"]
["D","Heating + Air Con","Other","ELECTRIC UFH","YES","39 °C","Room Temp","Room Thimble Sensor"]
["D","Heating + Air Con","Other","ELECTRIC UFH","YES","39 °C","Room Temp","AC Unit"]
["D","Heating + Air Con","Other","ELECTRIC UFH","YES","39 °C","Room Temp","Wired Controller"]
["D","Heating + Air Con","Other","ELECTRIC UFH","YES","40 °C","Room Temp","Room Thimble Sensor"]
["D","Heating + Air Con","Other","ELECTRIC UFH","YES","40 °C","Room Temp","AC Unit"]
["D","Heating + Air Con","Other","ELECTRIC UFH","YES","40 °C","Room Temp","Wired Controller"]
["E","Heating + Air Con","Other","RADIATOR","N/A","N/A","Room Temp","Room Thimble Sensor"]
["E","Heating + Air Con","Other","RADIATOR","N/A","N/A","Room Temp","AC Unit"]
["E","Heating + Air Con","Other","RADIATOR","N/A","N/A","Room Temp","Wired Controller"]
["F","AC only","Daikin","N/A","N/A","N/A","Room Temp","Room Thimble Sensor"]
["F","AC only","Daikin","N/A","N/A","N/A","Room Temp","AC Unit"]
["F","AC only","Daikin","N/A","N/A","N/A","Room Temp","Wired Controller"]
["F","AC only","Mitsubishi","N/A","N/A","N/A","Room Temp","Room Thimble Sensor"]
["F","AC only","Mitsubishi","N/A","N/A","N/A","Room Temp","AC Unit"]
["F","AC only","Mitsubishi","N/A","N/A","N/A","Room Temp","Wired Controller"]
["F","AC only","Toshiba","N/A","N/A","N/A","Room Temp","Room Thimble Sensor"]
["F","AC only","Toshiba","N/A","N/A","N/A","Room Temp","AC Unit"]
["F","AC only","Toshiba","N/A","N/A","N/A","Room Temp","Wired Controller"]
["F","AC only","Sanyo ","N/A","N/A","N/A","Room Temp","Room Thimble Sensor"]
["F","AC only","Sanyo ","N/A","N/A","N/A","Room Temp","AC Unit"]
["F","AC only","Sanyo ","N/A","N/A","N/A","Room Temp","Wired Controller"]
["F","AC only","Panasonic ","N/A","N/A","N/A","Room Temp","Room Thimble Sensor"]
["F","AC only","Panasonic ","N/A","N/A","N/A","Room Temp","AC Unit"]
["F","AC only","Panasonic ","N/A","N/A","N/A","Room Temp","Wired Controller"]
["F","AC only","Fujitsu ","N/A","N/A","N/A","Room Temp","Room Thimble Sensor"]
["F","AC only","Fujitsu ","N/A","N/A","N/A","Room Temp","AC Unit"]
["F","AC only","Fujitsu ","N/A","N/A","N/A","Room Temp","Wired Controller"]
["F","AC only","Hitachi ","N/A","N/A","N/A","Room Temp","Room Thimble Sensor"]
["F","AC only","Hitachi ","N/A","N/A","N/A","Room Temp","AC Unit"]
["F","AC only","Hitachi ","N/A","N/A","N/A","Room Temp","Wired Controller"]
["F","AC only","LG","N/A","N/A","N/A","Room Temp","Room Thimble Sensor"]
["F","AC only","LG","N/A","N/A","N/A","Room Temp","AC Unit"]
["F","AC only","LG","N/A","N/A","N/A","Room Temp","Wired Controller"]
["F","AC only","Other","N/A","N/A","N/A","Room Temp","Room Thimble Sensor"]
["F","AC only","Other","N/A","N/A","N/A","Room Temp","AC Unit"]
["F","AC only","Other","N/A","N/A","N/A","Room Temp","Wired Controller"]
["G","Heating","N/A","WET UFH","NO","N/A","Room Temp","Room Thimble Sensor"]
["G","Heating","N/A","WET UFH","NO","N/A","Room Temp","Wired Controller"]
["I","Heating","N/A","WET UFH","NO","N/A","Floor Temp","Floor Probe"]
["H","Heating","N/A","WET UFH","YES","TBA","Room Temp","Room Thimble Sensor"]
["H","Heating","N/A","WET UFH","YES","TBA","Room Temp","Wired Controller"]
["H","Heating","N/A","WET UFH","YES","25 °C","Room Temp","Room Thimble Sensor"]
["H","Heating","N/A","WET UFH","YES","25 °C","Room Temp","Wired Controller"]
["H","Heating","N/A","WET UFH","YES","26 °C","Room Temp","Room Thimble Sensor"]
["H","Heating","N/A","WET UFH","YES","26 °C","Room Temp","Wired Controller"]
["H","Heating","N/A","WET UFH","YES","27 °C","Room Temp","Room Thimble Sensor"]
["H","Heating","N/A","WET UFH","YES","27 °C","Room Temp","Wired Controller"]
["H","Heating","N/A","WET UFH","YES","28 °C","Room Temp","Room Thimble Sensor"]
["H","Heating","N/A","WET UFH","YES","28 °C","Room Temp","Wired Controller"]
["H","Heating","N/A","WET UFH","YES","29 °C","Room Temp","Room Thimble Sensor"]
["H","Heating","N/A","WET UFH","YES","29 °C","Room Temp","Wired Controller"]
["H","Heating","N/A","WET UFH","YES","30 °C","Room Temp","Room Thimble Sensor"]
["H","Heating","N/A","WET UFH","YES","30 °C","Room Temp","Wired Controller"]
["H","Heating","N/A","WET UFH","YES","31 °C","Room Temp","Room Thimble Sensor"]
["H","Heating","N/A","WET UFH","YES","31 °C","Room Temp","Wired Controller"]
["H","Heating","N/A","WET UFH","YES","32 °C","Room Temp","Room Thimble Sensor"]
["H","Heating","N/A","WET UFH","YES","32 °C","Room Temp","Wired Controller"]
["H","Heating","N/A","WET UFH","YES","33 °C","Room Temp","Room Thimble Sensor"]
["H","Heating","N/A","WET UFH","YES","33 °C","Room Temp","Wired Controller"]
["H","Heating","N/A","WET UFH","YES","34 °C","Room Temp","Room Thimble Sensor"]
["H","Heating","N/A","WET UFH","YES","34 °C","Room Temp","Wired Controller"]
["H","Heating","N/A","WET UFH","YES","35 °C","Room Temp","Room Thimble Sensor"]
["H","Heating","N/A","WET UFH","YES","35 °C","Room Temp","Wired Controller"]
["H","Heating","N/A","WET UFH","YES","36 °C","Room Temp","Room Thimble Sensor"]
["H","Heating","N/A","WET UFH","YES","36 °C","Room Temp","Wired Controller"]
["H","Heating","N/A","WET UFH","YES","37 °C","Room Temp","Room Thimble Sensor"]
["H","Heating","N/A","WET UFH","YES","37 °C","Room Temp","Wired Controller"]
["H","Heating","N/A","WET UFH","YES","38 °C","Room Temp","Room Thimble Sensor"]
["H","Heating","N/A","WET UFH","YES","38 °C","Room Temp","Wired Controller"]
["H","Heating","N/A","WET UFH","YES","39 °C","Room Temp","Room Thimble Sensor"]
["H","Heating","N/A","WET UFH","YES","39 °C","Room Temp","Wired Controller"]
["H","Heating","N/A","WET UFH","YES","40 °C","Room Temp","Room Thimble Sensor"]
["H","Heating","N/A","WET UFH","YES","40 °C","Room Temp","Wired Controller"]
["J","Heating","N/A","ELECTRIC UFH","NO","N/A","Room Temp","Room Thimble Sensor"]
["J","Heating","N/A","ELECTRIC UFH","NO","N/A","Room Temp","Wired Controller"]
["L","Heating","N/A","ELECTRIC UFH","NO","N/A","Floor Temp","Floor Probe"]
["K","Heating","N/A","ELECTRIC UFH","YES","TBA","Room Temp","Room Thimble Sensor"]
["K","Heating","N/A","ELECTRIC UFH","YES","TBA","Room Temp","Wired Controller"]
["K","Heating","N/A","ELECTRIC UFH","YES","25 °C","Room Temp","Room Thimble Sensor"]
["K","Heating","N/A","ELECTRIC UFH","YES","25 °C","Room Temp","Wired Controller"]
["K","Heating","N/A","ELECTRIC UFH","YES","26 °C","Room Temp","Room Thimble Sensor"]
["K","Heating","N/A","ELECTRIC UFH","YES","26 °C","Room Temp","Wired Controller"]
["K","Heating","N/A","ELECTRIC UFH","YES","27 °C","Room Temp","Room Thimble Sensor"]
["K","Heating","N/A","ELECTRIC UFH","YES","27 °C","Room Temp","Wired Controller"]
["K","Heating","N/A","ELECTRIC UFH","YES","28 °C","Room Temp","Room Thimble Sensor"]
["K","Heating","N/A","ELECTRIC UFH","YES","28 °C","Room Temp","Wired Controller"]
["K","Heating","N/A","ELECTRIC UFH","YES","29 °C","Room Temp","Room Thimble Sensor"]
["K","Heating","N/A","ELECTRIC UFH","YES","29 °C","Room Temp","Wired Controller"]
["K","Heating","N/A","ELECTRIC UFH","YES","30 °C","Room Temp","Room Thimble Sensor"]
["K","Heating","N/A","ELECTRIC UFH","YES","30 °C","Room Temp","Wired Controller"]
["K","Heating","N/A","ELECTRIC UFH","YES","31 °C","Room Temp","Room Thimble Sensor"]
["K","Heating","N/A","ELECTRIC UFH","YES","31 °C","Room Temp","Wired Controller"]
["K","Heating","N/A","ELECTRIC UFH","YES","32 °C","Room Temp","Room Thimble Sensor"]
["K","Heating","N/A","ELECTRIC UFH","YES","32 °C","Room Temp","Wired Controller"]
["K","Heating","N/A","ELECTRIC UFH","YES","33 °C","Room Temp","Room Thimble Sensor"]
["K","Heating","N/A","ELECTRIC UFH","YES","33 °C","Room Temp","Wired Controller"]
["K","Heating","N/A","ELECTRIC UFH","YES","34 °C","Room Temp","Room Thimble Sensor"]
["K","Heating","N/A","ELECTRIC UFH","YES","34 °C","Room Temp","Wired Controller"]
["K","Heating","N/A","ELECTRIC UFH","YES","35 °C","Room Temp","Room Thimble Sensor"]
["K","Heating","N/A","ELECTRIC UFH","YES","35 °C","Room Temp","Wired Controller"]
["K","Heating","N/A","ELECTRIC UFH","YES","36 °C","Room Temp","Room Thimble Sensor"]
["K","Heating","N/A","ELECTRIC UFH","YES","36 °C","Room Temp","Wired Controller"]
["K","Heating","N/A","ELECTRIC UFH","YES","37 °C","Room Temp","Room Thimble Sensor"]
["K","Heating","N/A","ELECTRIC UFH","YES","37 °C","Room Temp","Wired Controller"]
["K","Heating","N/A","ELECTRIC UFH","YES","38 °C","Room Temp","Room Thimble Sensor"]
["K","Heating","N/A","ELECTRIC UFH","YES","38 °C","Room Temp","Wired Controller"]
["K","Heating","N/A","ELECTRIC UFH","YES","39 °C","Room Temp","Room Thimble Sensor"]
["K","Heating","N/A","ELECTRIC UFH","YES","39 °C","Room Temp","Wired Controller"]
["K","Heating","N/A","ELECTRIC UFH","YES","40 °C","Room Temp","Room Thimble Sensor"]
["K","Heating","N/A","ELECTRIC UFH","YES","40 °C","Room Temp","Wired Controller"]
["M","Heating","N/A","RADIATOR","N/A","N/A","Room Temp","Room Thimble Sensor"]
["M","Heating","N/A","RADIATOR","N/A","N/A","Room Temp","Wired Controller"]
["O","Towel Rad ON/OFF Only","N/A","N/A","N/A","N/A","ON/OFF Only","N/A"]
["P","Towel Rad Temp Control","N/A","RADIATOR","N/A","N/A","Room Temp","Room Thimble Sensor"]
["P","Towel Rad Temp Control","N/A","RADIATOR","N/A","N/A","Room Temp","Wired Controller"]
["N","ON/OFF SWITCH","N/A","N/A","N/A","N/A","ON/OFF Only","N/A"]
["Q","Hot Water ON/OFF","N/A","N/A","N/A","N/A","ON/OFF Only","N/A"]
["R","Hot Water, Temp Control (Valve Only)","N/A","N/A","N/A","N/A","Cylinder Temp","Cylinder Probe"]
["S","Hot Water, Temp Control (Valve & Boiler)","N/A","N/A","N/A","N/A","Cylinder Temp","Cylinder Probe"]
["FA","Heating + FCU","PLEASE SELECT","WET UFH","NO","N/A","Room Temp","Wired Controller"]
["FA","Heating + FCU","Daikin","WET UFH","NO","N/A","Room Temp","Wired Controller"]
["FA","Heating + FCU","Mitsubishi","WET UFH","NO","N/A","Room Temp","Wired Controller"]
["FA","Heating + FCU","Toshiba","WET UFH","NO","N/A","Room Temp","Wired Controller"]
["FA","Heating + FCU","Sanyo ","WET UFH","NO","N/A","Room Temp","Wired Controller"]
["FA","Heating + FCU","Panasonic ","WET UFH","NO","N/A","Room Temp","Wired Controller"]
["FA","Heating + FCU","Fujitsu ","WET UFH","NO","N/A","Room Temp","Wired Controller"]
["FA","Heating + FCU","Hitachi ","WET UFH","NO","N/A","Room Temp","Wired Controller"]
["FA","Heating + FCU","LG","WET UFH","NO","N/A","Room Temp","Wired Controller"]
["FA","Heating + FCU","Other","WET UFH","NO","N/A","Room Temp","Wired Controller"]
["FB","Heating + FCU","PLEASE SELECT","WET UFH","YES","PLEASE SELECT","Room Temp","Wired Controller"]
["FB","Heating + FCU","Daikin","WET UFH","YES","TBA","Room Temp","Wired Controller"]
["FB","Heating + FCU","Daikin","WET UFH","YES","25 °C","Room Temp","Wired Controller"]
["FB","Heating + FCU","Daikin","WET UFH","YES","26 °C","Room Temp","Wired Controller"]
["FB","Heating + FCU","Daikin","WET UFH","YES","27 °C","Room Temp","Wired Controller"]
["FB","Heating + FCU","Daikin","WET UFH","YES","28 °C","Room Temp","Wired Controller"]
["FB","Heating + FCU","Daikin","WET UFH","YES","29 °C","Room Temp","Wired Controller"]
["FB","Heating + FCU","Daikin","WET UFH","YES","30 °C","Room Temp","Wired Controller"]
["FB","Heating + FCU","Daikin","WET UFH","YES","31 °C","Room Temp","Wired Controller"]
["FB","Heating + FCU","Daikin","WET UFH","YES","32 °C","Room Temp","Wired Controller"]
["FB","Heating + FCU","Daikin","WET UFH","YES","33 °C","Room Temp","Wired Controller"]
["FB","Heating + FCU","Daikin","WET UFH","YES","34 °C","Room Temp","Wired Controller"]
["FB","Heating + FCU","Daikin","WET UFH","YES","35 °C","Room Temp","Wired Controller"]
["FB","Heating + FCU","Daikin","WET UFH","YES","36 °C","Room Temp","Wired Controller"]
["FB","Heating + FCU","Daikin","WET UFH","YES","37 °C","Room Temp","Wired Controller"]
["FB","Heating + FCU","Daikin","WET UFH","YES","38 °C","Room Temp","Wired Controller"]
["FB","Heating + FCU","Daikin","WET UFH","YES","39 °C","Room Temp","Wired Controller"]
["FB","Heating + FCU","Daikin","WET UFH","YES","40 °C","Room Temp","Wired Controller"]
["FB","Heating + FCU","Mitsubishi","WET UFH","YES","TBA","Room Temp","Wired Controller"]
["FB","Heating + FCU","Mitsubishi","WET UFH","YES","25 °C","Room Temp","Wired Controller"]
["FB","Heating + FCU","Mitsubishi","WET UFH","YES","26 °C","Room Temp","Wired Controller"]
["FB","Heating + FCU","Mitsubishi","WET UFH","YES","27 °C","Room Temp","Wired Controller"]
["FB","Heating + FCU","Mitsubishi","WET UFH","YES","28 °C","Room Temp","Wired Controller"]
["FB","Heating + FCU","Mitsubishi","WET UFH","YES","29 °C","Room Temp","Wired Controller"]
["FB","Heating + FCU","Mitsubishi","WET UFH","YES","30 °C","Room Temp","Wired Controller"]
["FB","Heating + FCU","Mitsubishi","WET UFH","YES","31 °C","Room Temp","Wired Controller"]
["FB","Heating + FCU","Mitsubishi","WET UFH","YES","32 °C","Room Temp","Wired Controller"]
["FB","Heating + FCU","Mitsubishi","WET UFH","YES","33 °C","Room Temp","Wired Controller"]
["FB","Heating + FCU","Mitsubishi","WET UFH","YES","34 °C","Room Temp","Wired Controller"]
["FB","Heating + FCU","Mitsubishi","WET UFH","YES","35 °C","Room Temp","Wired Controller"]
["FB","Heating + FCU","Mitsubishi","WET UFH","YES","36 °C","Room Temp","Wired Controller"]
["FB","Heating + FCU","Mitsubishi","WET UFH","YES","37 °C","Room Temp","Wired Controller"]
["FB","Heating + FCU","Mitsubishi","WET UFH","YES","38 °C","Room Temp","Wired Controller"]
["FB","Heating + FCU","Mitsubishi","WET UFH","YES","39 °C","Room Temp","Wired Controller"]
["FB","Heating + FCU","Mitsubishi","WET UFH","YES","40 °C","Room Temp","Wired Controller"]
["FB","Heating + FCU","Toshiba","WET UFH","YES","TBA","Room Temp","Wired Controller"]
["FB","Heating + FCU","Toshiba","WET UFH","YES","25 °C","Room Temp","Wired Controller"]
["FB","Heating + FCU","Toshiba","WET UFH","YES","26 °C","Room Temp","Wired Controller"]
["FB","Heating + FCU","Toshiba","WET UFH","YES","27 °C","Room Temp","Wired Controller"]
["FB","Heating + FCU","Toshiba","WET UFH","YES","28 °C","Room Temp","Wired Controller"]
["FB","Heating + FCU","Toshiba","WET UFH","YES","29 °C","Room Temp","Wired Controller"]
["FB","Heating + FCU","Toshiba","WET UFH","YES","30 °C","Room Temp","Wired Controller"]
["FB","Heating + FCU","Toshiba","WET UFH","YES","31 °C","Room Temp","Wired Controller"]
["FB","Heating + FCU","Toshiba","WET UFH","YES","32 °C","Room Temp","Wired Controller"]
["FB","Heating + FCU","Toshiba","WET UFH","YES","33 °C","Room Temp","Wired Controller"]
["FB","Heating + FCU","Toshiba","WET UFH","YES","34 °C","Room Temp","Wired Controller"]
["FB","Heating + FCU","Toshiba","WET UFH","YES","35 °C","Room Temp","Wired Controller"]
["FB","Heating + FCU","Toshiba","WET UFH","YES","36 °C","Room Temp","Wired Controller"]
["FB","Heating + FCU","Toshiba","WET UFH","YES","37 °C","Room Temp","Wired Controller"]
["FB","Heating + FCU","Toshiba","WET UFH","YES","38 °C","Room Temp","Wired Controller"]
["FB","Heating + FCU","Toshiba","WET UFH","YES","39 °C","Room Temp","Wired Controller"]
["FB","Heating + FCU","Toshiba","WET UFH","YES","40 °C","Room Temp","Wired Controller"]
["FB","Heating + FCU","Sanyo ","WET UFH","YES","TBA","Room Temp","Wired Controller"]
["FB","Heating + FCU","Sanyo ","WET UFH","YES","25 °C","Room Temp","Wired Controller"]
["FB","Heating + FCU","Sanyo ","WET UFH","YES","26 °C","Room Temp","Wired Controller"]
["FB","Heating + FCU","Sanyo ","WET UFH","YES","27 °C","Room Temp","Wired Controller"]
["FB","Heating + FCU","Sanyo ","WET UFH","YES","28 °C","Room Temp","Wired Controller"]
["FB","Heating + FCU","Sanyo ","WET UFH","YES","29 °C","Room Temp","Wired Controller"]
["FB","Heating + FCU","Sanyo ","WET UFH","YES","30 °C","Room Temp","Wired Controller"]
["FB","Heating + FCU","Sanyo ","WET UFH","YES","31 °C","Room Temp","Wired Controller"]
["FB","Heating + FCU","Sanyo ","WET UFH","YES","32 °C","Room Temp","Wired Controller"]
["FB","Heating + FCU","Sanyo ","WET UFH","YES","33 °C","Room Temp","Wired Controller"]
["FB","Heating + FCU","Sanyo ","WET UFH","YES","34 °C","Room Temp","Wired Controller"]
["FB","Heating + FCU","Sanyo ","WET UFH","YES","35 °C","Room Temp","Wired Controller"]
["FB","Heating + FCU","Sanyo ","WET UFH","YES","36 °C","Room Temp","Wired Controller"]
["FB","Heating + FCU","Sanyo ","WET UFH","YES","37 °C","Room Temp","Wired Controller"]
["FB","Heating + FCU","Sanyo ","WET UFH","YES","38 °C","Room Temp","Wired Controller"]
["FB","Heating + FCU","Sanyo ","WET UFH","YES","39 °C","Room Temp","Wired Controller"]
["FB","Heating + FCU","Sanyo ","WET UFH","YES","40 °C","Room Temp","Wired Controller"]
["FB","Heating + FCU","Panasonic ","WET UFH","YES","TBA","Room Temp","Wired Controller"]
["FB","Heating + FCU","Panasonic ","WET UFH","YES","25 °C","Room Temp","Wired Controller"]
["FB","Heating + FCU","Panasonic ","WET UFH","YES","26 °C","Room Temp","Wired Controller"]
["FB","Heating + FCU","Panasonic ","WET UFH","YES","27 °C","Room Temp","Wired Controller"]
["FB","Heating + FCU","Panasonic ","WET UFH","YES","28 °C","Room Temp","Wired Controller"]
["FB","Heating + FCU","Panasonic ","WET UFH","YES","29 °C","Room Temp","Wired Controller"]
["FB","Heating + FCU","Panasonic ","WET UFH","YES","30 °C","Room Temp","Wired Controller"]
["FB","Heating + FCU","Panasonic ","WET UFH","YES","31 °C","Room Temp","Wired Controller"]
["FB","Heating + FCU","Panasonic ","WET UFH","YES","32 °C","Room Temp","Wired Controller"]
["FB","Heating + FCU","Panasonic ","WET UFH","YES","33 °C","Room Temp","Wired Controller"]
["FB","Heating + FCU","Panasonic ","WET UFH","YES","34 °C","Room Temp","Wired Controller"]
["FB","Heating + FCU","Panasonic ","WET UFH","YES","35 °C","Room Temp","Wired Controller"]
["FB","Heating + FCU","Panasonic ","WET UFH","YES","36 °C","Room Temp","Wired Controller"]
["FB","Heating + FCU","Panasonic ","WET UFH","YES","37 °C","Room Temp","Wired Controller"]
["FB","Heating + FCU","Panasonic ","WET UFH","YES","38 °C","Room Temp","Wired Controller"]
["FB","Heating + FCU","Panasonic ","WET UFH","YES","39 °C","Room Temp","Wired Controller"]
["FB","Heating + FCU","Panasonic ","WET UFH","YES","40 °C","Room Temp","Wired Controller"]
["FB","Heating + FCU","Fujitsu ","WET UFH","YES","TBA","Room Temp","Wired Controller"]
["FB","Heating + FCU","Fujitsu ","WET UFH","YES","25 °C","Room Temp","Wired Controller"]
["FB","Heating + FCU","Fujitsu ","WET UFH","YES","26 °C","Room Temp","Wired Controller"]
["FB","Heating + FCU","Fujitsu ","WET UFH","YES","27 °C","Room Temp","Wired Controller"]
["FB","Heating + FCU","Fujitsu ","WET UFH","YES","28 °C","Room Temp","Wired Controller"]
["FB","Heating + FCU","Fujitsu ","WET UFH","YES","29 °C","Room Temp","Wired Controller"]
["FB","Heating + FCU","Fujitsu ","WET UFH","YES","30 °C","Room Temp","Wired Controller"]
["FB","Heating + FCU","Fujitsu ","WET UFH","YES","31 °C","Room Temp","Wired Controller"]
["FB","Heating + FCU","Fujitsu ","WET UFH","YES","32 °C","Room Temp","Wired Controller"]
["FB","Heating + FCU","Fujitsu ","WET UFH","YES","33 °C","Room Temp","Wired Controller"]
["FB","Heating + FCU","Fujitsu ","WET UFH","YES","34 °C","Room Temp","Wired Controller"]
["FB","Heating + FCU","Fujitsu ","WET UFH","YES","35 °C","Room Temp","Wired Controller"]
["FB","Heating + FCU","Fujitsu ","WET UFH","YES","36 °C","Room Temp","Wired Controller"]
["FB","Heating + FCU","Fujitsu ","WET UFH","YES","37 °C","Room Temp","Wired Controller"]
["FB","Heating + FCU","Fujitsu ","WET UFH","YES","38 °C","Room Temp","Wired Controller"]
["FB","Heating + FCU","Fujitsu ","WET UFH","YES","39 °C","Room Temp","Wired Controller"]
["FB","Heating + FCU","Fujitsu ","WET UFH","YES","40 °C","Room Temp","Wired Controller"]
["FB","Heating + FCU","Hitachi ","WET UFH","YES","TBA","Room Temp","Wired Controller"]
["FB","Heating + FCU","Hitachi ","WET UFH","YES","25 °C","Room Temp","Wired Controller"]
["FB","Heating + FCU","Hitachi ","WET UFH","YES","26 °C","Room Temp","Wired Controller"]
["FB","Heating + FCU","Hitachi ","WET UFH","YES","27 °C","Room Temp","Wired Controller"]
["FB","Heating + FCU","Hitachi ","WET UFH","YES","28 °C","Room Temp","Wired Controller"]
["FB","Heating + FCU","Hitachi ","WET UFH","YES","29 °C","Room Temp","Wired Controller"]
["FB","Heating + FCU","Hitachi ","WET UFH","YES","30 °C","Room Temp","Wired Controller"]
["FB","Heating + FCU","Hitachi ","WET UFH","YES","31 °C","Room Temp","Wired Controller"]
["FB","Heating + FCU","Hitachi ","WET UFH","YES","32 °C","Room Temp","Wired Controller"]
["FB","Heating + FCU","Hitachi ","WET UFH","YES","33 °C","Room Temp","Wired Controller"]
["FB","Heating + FCU","Hitachi ","WET UFH","YES","34 °C","Room Temp","Wired Controller"]
["FB","Heating + FCU","Hitachi ","WET UFH","YES","35 °C","Room Temp","Wired Controller"]
["FB","Heating + FCU","Hitachi ","WET UFH","YES","36 °C","Room Temp","Wired Controller"]
["FB","Heating + FCU","Hitachi ","WET UFH","YES","37 °C","Room Temp","Wired Controller"]
["FB","Heating + FCU","Hitachi ","WET UFH","YES","38 °C","Room Temp","Wired Controller"]
["FB","Heating + FCU","Hitachi ","WET UFH","YES","39 °C","Room Temp","Wired Controller"]
["FB","Heating + FCU","Hitachi ","WET UFH","YES","40 °C","Room Temp","Wired Controller"]
["FB","Heating + FCU","LG","WET UFH","YES","TBA","Room Temp","Wired Controller"]
["FB","Heating + FCU","LG","WET UFH","YES","25 °C","Room Temp","Wired Controller"]
["FB","Heating + FCU","LG","WET UFH","YES","26 °C","Room Temp","Wired Controller"]
["FB","Heating + FCU","LG","WET UFH","YES","27 °C","Room Temp","Wired Controller"]
["FB","Heating + FCU","LG","WET UFH","YES","28 °C","Room Temp","Wired Controller"]
["FB","Heating + FCU","LG","WET UFH","YES","29 °C","Room Temp","Wired Controller"]
["FB","Heating + FCU","LG","WET UFH","YES","30 °C","Room Temp","Wired Controller"]
["FB","Heating + FCU","LG","WET UFH","YES","31 °C","Room Temp","Wired Controller"]
["FB","Heating + FCU","LG","WET UFH","YES","32 °C","Room Temp","Wired Controller"]
["FB","Heating + FCU","LG","WET UFH","YES","33 °C","Room Temp","Wired Controller"]
["FB","Heating + FCU","LG","WET UFH","YES","34 °C","Room Temp","Wired Controller"]
["FB","Heating + FCU","LG","WET UFH","YES","35 °C","Room Temp","Wired Controller"]
["FB","Heating + FCU","LG","WET UFH","YES","36 °C","Room Temp","Wired Controller"]
["FB","Heating + FCU","LG","WET UFH","YES","37 °C","Room Temp","Wired Controller"]
["FB","Heating + FCU","LG","WET UFH","YES","38 °C","Room Temp","Wired Controller"]
["FB","Heating + FCU","LG","WET UFH","YES","39 °C","Room Temp","Wired Controller"]
["FB","Heating + FCU","LG","WET UFH","YES","40 °C","Room Temp","Wired Controller"]
["FB","Heating + FCU","Other","WET UFH","YES","TBA","Room Temp","Wired Controller"]
["FB","Heating + FCU","Other","WET UFH","YES","25 °C","Room Temp","Wired Controller"]
["FB","Heating + FCU","Other","WET UFH","YES","26 °C","Room Temp","Wired Controller"]
["FB","Heating + FCU","Other","WET UFH","YES","27 °C","Room Temp","Wired Controller"]
["FB","Heating + FCU","Other","WET UFH","YES","28 °C","Room Temp","Wired Controller"]
["FB","Heating + FCU","Other","WET UFH","YES","29 °C","Room Temp","Wired Controller"]
["FB","Heating + FCU","Other","WET UFH","YES","30 °C","Room Temp","Wired Controller"]
["FB","Heating + FCU","Other","WET UFH","YES","31 °C","Room Temp","Wired Controller"]
["FB","Heating + FCU","Other","WET UFH","YES","32 °C","Room Temp","Wired Controller"]
["FB","Heating + FCU","Other","WET UFH","YES","33 °C","Room Temp","Wired Controller"]
["FB","Heating + FCU","Other","WET UFH","YES","34 °C","Room Temp","Wired Controller"]
["FB","Heating + FCU","Other","WET UFH","YES","35 °C","Room Temp","Wired Controller"]
["FB","Heating + FCU","Other","WET UFH","YES","36 °C","Room Temp","Wired Controller"]
["FB","Heating + FCU","Other","WET UFH","YES","37 °C","Room Temp","Wired Controller"]
["FB","Heating + FCU","Other","WET UFH","YES","38 °C","Room Temp","Wired Controller"]
["FB","Heating + FCU","Other","WET UFH","YES","39 °C","Room Temp","Wired Controller"]
["FB","Heating + FCU","Other","WET UFH","YES","40 °C","Room Temp","Wired Controller"]
["FC","Heating + FCU","PLEASE SELECT","ELECTRIC UFH","NO","N/A","Room Temp","Wired Controller"]
["FC","Heating + FCU","Daikin","ELECTRIC UFH","NO","N/A","Room Temp","Wired Controller"]
["FC","Heating + FCU","Mitsubishi","ELECTRIC UFH","NO","N/A","Room Temp","Wired Controller"]
["FC","Heating + FCU","Toshiba","ELECTRIC UFH","NO","N/A","Room Temp","Wired Controller"]
["FC","Heating + FCU","Sanyo ","ELECTRIC UFH","NO","N/A","Room Temp","Wired Controller"]
["FC","Heating + FCU","Panasonic ","ELECTRIC UFH","NO","N/A","Room Temp","Wired Controller"]
["FC","Heating + FCU","Fujitsu ","ELECTRIC UFH","NO","N/A","Room Temp","Wired Controller"]
["FC","Heating + FCU","Hitachi ","ELECTRIC UFH","NO","N/A","Room Temp","Wired Controller"]
["FC","Heating + FCU","LG","ELECTRIC UFH","NO","N/A","Room Temp","Wired Controller"]
["FC","Heating + FCU","Other","ELECTRIC UFH","NO","N/A","Room Temp","Wired Controller"]
["FD","Heating + FCU","PLEASE SELECT","ELECTRIC UFH","YES","PLEASE SELECT","Room Temp","Wired Controller"]
["FD","Heating + FCU","Daikin","ELECTRIC UFH","YES","TBA","Room Temp","Wired Controller"]
["FD","Heating + FCU","Daikin","ELECTRIC UFH","YES","25 °C","Room Temp","Wired Controller"]
["FD","Heating + FCU","Daikin","ELECTRIC UFH","YES","26 °C","Room Temp","Wired Controller"]
["FD","Heating + FCU","Daikin","ELECTRIC UFH","YES","27 °C","Room Temp","Wired Controller"]
["FD","Heating + FCU","Daikin","ELECTRIC UFH","YES","28 °C","Room Temp","Wired Controller"]
["FD","Heating + FCU","Daikin","ELECTRIC UFH","YES","29 °C","Room Temp","Wired Controller"]
["FD","Heating + FCU","Daikin","ELECTRIC UFH","YES","30 °C","Room Temp","Wired Controller"]
["FD","Heating + FCU","Daikin","ELECTRIC UFH","YES","31 °C","Room Temp","Wired Controller"]
["FD","Heating + FCU","Daikin","ELECTRIC UFH","YES","32 °C","Room Temp","Wired Controller"]
["FD","Heating + FCU","Daikin","ELECTRIC UFH","YES","33 °C","Room Temp","Wired Controller"]
["FD","Heating + FCU","Daikin","ELECTRIC UFH","YES","34 °C","Room Temp","Wired Controller"]
["FD","Heating + FCU","Daikin","ELECTRIC UFH","YES","35 °C","Room Temp","Wired Controller"]
["FD","Heating + FCU","Daikin","ELECTRIC UFH","YES","36 °C","Room Temp","Wired Controller"]
["FD","Heating + FCU","Daikin","ELECTRIC UFH","YES","37 °C","Room Temp","Wired Controller"]
["FD","Heating + FCU","Daikin","ELECTRIC UFH","YES","38 °C","Room Temp","Wired Controller"]
["FD","Heating + FCU","Daikin","ELECTRIC UFH","YES","39 °C","Room Temp","Wired Controller"]
["FD","Heating + FCU","Daikin","ELECTRIC UFH","YES","40 °C","Room Temp","Wired Controller"]
["FD","Heating + FCU","Mitsubishi","ELECTRIC UFH","YES","TBA","Room Temp","Wired Controller"]
["FD","Heating + FCU","Mitsubishi","ELECTRIC UFH","YES","25 °C","Room Temp","Wired Controller"]
["FD","Heating + FCU","Mitsubishi","ELECTRIC UFH","YES","26 °C","Room Temp","Wired Controller"]
["FD","Heating + FCU","Mitsubishi","ELECTRIC UFH","YES","27 °C","Room Temp","Wired Controller"]
["FD","Heating + FCU","Mitsubishi","ELECTRIC UFH","YES","28 °C","Room Temp","Wired Controller"]
["FD","Heating + FCU","Mitsubishi","ELECTRIC UFH","YES","29 °C","Room Temp","Wired Controller"]
["FD","Heating + FCU","Mitsubishi","ELECTRIC UFH","YES","30 °C","Room Temp","Wired Controller"]
["FD","Heating + FCU","Mitsubishi","ELECTRIC UFH","YES","31 °C","Room Temp","Wired Controller"]
["FD","Heating + FCU","Mitsubishi","ELECTRIC UFH","YES","32 °C","Room Temp","Wired Controller"]
["FD","Heating + FCU","Mitsubishi","ELECTRIC UFH","YES","33 °C","Room Temp","Wired Controller"]
["FD","Heating + FCU","Mitsubishi","ELECTRIC UFH","YES","34 °C","Room Temp","Wired Controller"]
["FD","Heating + FCU","Mitsubishi","ELECTRIC UFH","YES","35 °C","Room Temp","Wired Controller"]
["FD","Heating + FCU","Mitsubishi","ELECTRIC UFH","YES","36 °C","Room Temp","Wired Controller"]
["FD","Heating + FCU","Mitsubishi","ELECTRIC UFH","YES","37 °C","Room Temp","Wired Controller"]
["FD","Heating + FCU","Mitsubishi","ELECTRIC UFH","YES","38 °C","Room Temp","Wired Controller"]
["FD","Heating + FCU","Mitsubishi","ELECTRIC UFH","YES","39 °C","Room Temp","Wired Controller"]
["FD","Heating + FCU","Mitsubishi","ELECTRIC UFH","YES","40 °C","Room Temp","Wired Controller"]
["FD","Heating + FCU","Toshiba","ELECTRIC UFH","YES","TBA","Room Temp","Wired Controller"]
["FD","Heating + FCU","Toshiba","ELECTRIC UFH","YES","25 °C","Room Temp","Wired Controller"]
["FD","Heating + FCU","Toshiba","ELECTRIC UFH","YES","26 °C","Room Temp","Wired Controller"]
["FD","Heating + FCU","Toshiba","ELECTRIC UFH","YES","27 °C","Room Temp","Wired Controller"]
["FD","Heating + FCU","Toshiba","ELECTRIC UFH","YES","28 °C","Room Temp","Wired Controller"]
["FD","Heating + FCU","Toshiba","ELECTRIC UFH","YES","29 °C","Room Temp","Wired Controller"]
["FD","Heating + FCU","Toshiba","ELECTRIC UFH","YES","30 °C","Room Temp","Wired Controller"]
["FD","Heating + FCU","Toshiba","ELECTRIC UFH","YES","31 °C","Room Temp","Wired Controller"]
["FD","Heating + FCU","Toshiba","ELECTRIC UFH","YES","32 °C","Room Temp","Wired Controller"]
["FD","Heating + FCU","Toshiba","ELECTRIC UFH","YES","33 °C","Room Temp","Wired Controller"]
["FD","Heating + FCU","Toshiba","ELECTRIC UFH","YES","34 °C","Room Temp","Wired Controller"]
["FD","Heating + FCU","Toshiba","ELECTRIC UFH","YES","35 °C","Room Temp","Wired Controller"]
["FD","Heating + FCU","Toshiba","ELECTRIC UFH","YES","36 °C","Room Temp","Wired Controller"]
["FD","Heating + FCU","Toshiba","ELECTRIC UFH","YES","37 °C","Room Temp","Wired Controller"]
["FD","Heating + FCU","Toshiba","ELECTRIC UFH","YES","38 °C","Room Temp","Wired Controller"]
["FD","Heating + FCU","Toshiba","ELECTRIC UFH","YES","39 °C","Room Temp","Wired Controller"]
["FD","Heating + FCU","Toshiba","ELECTRIC UFH","YES","40 °C","Room Temp","Wired Controller"]
["FD","Heating + FCU","Sanyo ","ELECTRIC UFH","YES","TBA","Room Temp","Wired Controller"]
["FD","Heating + FCU","Sanyo ","ELECTRIC UFH","YES","25 °C","Room Temp","Wired Controller"]
["FD","Heating + FCU","Sanyo ","ELECTRIC UFH","YES","26 °C","Room Temp","Wired Controller"]
["FD","Heating + FCU","Sanyo ","ELECTRIC UFH","YES","27 °C","Room Temp","Wired Controller"]
["FD","Heating + FCU","Sanyo ","ELECTRIC UFH","YES","28 °C","Room Temp","Wired Controller"]
["FD","Heating + FCU","Sanyo ","ELECTRIC UFH","YES","29 °C","Room Temp","Wired Controller"]
["FD","Heating + FCU","Sanyo ","ELECTRIC UFH","YES","30 °C","Room Temp","Wired Controller"]
["FD","Heating + FCU","Sanyo ","ELECTRIC UFH","YES","31 °C","Room Temp","Wired Controller"]
["FD","Heating + FCU","Sanyo ","ELECTRIC UFH","YES","32 °C","Room Temp","Wired Controller"]
["FD","Heating + FCU","Sanyo ","ELECTRIC UFH","YES","33 °C","Room Temp","Wired Controller"]
["FD","Heating + FCU","Sanyo ","ELECTRIC UFH","YES","34 °C","Room Temp","Wired Controller"]
["FD","Heating + FCU","Sanyo ","ELECTRIC UFH","YES","35 °C","Room Temp","Wired Controller"]
["FD","Heating + FCU","Sanyo ","ELECTRIC UFH","YES","36 °C","Room Temp","Wired Controller"]
["FD","Heating + FCU","Sanyo ","ELECTRIC UFH","YES","37 °C","Room Temp","Wired Controller"]
["FD","Heating + FCU","Sanyo ","ELECTRIC UFH","YES","38 °C","Room Temp","Wired Controller"]
["FD","Heating + FCU","Sanyo ","ELECTRIC UFH","YES","39 °C","Room Temp","Wired Controller"]
["FD","Heating + FCU","Sanyo ","ELECTRIC UFH","YES","40 °C","Room Temp","Wired Controller"]
["FD","Heating + FCU","Panasonic ","ELECTRIC UFH","YES","TBA","Room Temp","Wired Controller"]
["FD","Heating + FCU","Panasonic ","ELECTRIC UFH","YES","25 °C","Room Temp","Wired Controller"]
["FD","Heating + FCU","Panasonic ","ELECTRIC UFH","YES","26 °C","Room Temp","Wired Controller"]
["FD","Heating + FCU","Panasonic ","ELECTRIC UFH","YES","27 °C","Room Temp","Wired Controller"]
["FD","Heating + FCU","Panasonic ","ELECTRIC UFH","YES","28 °C","Room Temp","Wired Controller"]
["FD","Heating + FCU","Panasonic ","ELECTRIC UFH","YES","29 °C","Room Temp","Wired Controller"]
["FD","Heating + FCU","Panasonic ","ELECTRIC UFH","YES","30 °C","Room Temp","Wired Controller"]
["FD","Heating + FCU","Panasonic ","ELECTRIC UFH","YES","31 °C","Room Temp","Wired Controller"]
["FD","Heating + FCU","Panasonic ","ELECTRIC UFH","YES","32 °C","Room Temp","Wired Controller"]
["FD","Heating + FCU","Panasonic ","ELECTRIC UFH","YES","33 °C","Room Temp","Wired Controller"]
["FD","Heating + FCU","Panasonic ","ELECTRIC UFH","YES","34 °C","Room Temp","Wired Controller"]
["FD","Heating + FCU","Panasonic ","ELECTRIC UFH","YES","35 °C","Room Temp","Wired Controller"]
["FD","Heating + FCU","Panasonic ","ELECTRIC UFH","YES","36 °C","Room Temp","Wired Controller"]
["FD","Heating + FCU","Panasonic ","ELECTRIC UFH","YES","37 °C","Room Temp","Wired Controller"]
["FD","Heating + FCU","Panasonic ","ELECTRIC UFH","YES","38 °C","Room Temp","Wired Controller"]
["FD","Heating + FCU","Panasonic ","ELECTRIC UFH","YES","39 °C","Room Temp","Wired Controller"]
["FD","Heating + FCU","Panasonic ","ELECTRIC UFH","YES","40 °C","Room Temp","Wired Controller"]
["FD","Heating + FCU","Fujitsu ","ELECTRIC UFH","YES","TBA","Room Temp","Wired Controller"]
["FD","Heating + FCU","Fujitsu ","ELECTRIC UFH","YES","25 °C","Room Temp","Wired Controller"]
["FD","Heating + FCU","Fujitsu ","ELECTRIC UFH","YES","26 °C","Room Temp","Wired Controller"]
["FD","Heating + FCU","Fujitsu ","ELECTRIC UFH","YES","27 °C","Room Temp","Wired Controller"]
["FD","Heating + FCU","Fujitsu ","ELECTRIC UFH","YES","28 °C","Room Temp","Wired Controller"]
["FD","Heating + FCU","Fujitsu ","ELECTRIC UFH","YES","29 °C","Room Temp","Wired Controller"]
["FD","Heating + FCU","Fujitsu ","ELECTRIC UFH","YES","30 °C","Room Temp","Wired Controller"]
["FD","Heating + FCU","Fujitsu ","ELECTRIC UFH","YES","31 °C","Room Temp","Wired Controller"]
["FD","Heating + FCU","Fujitsu ","ELECTRIC UFH","YES","32 °C","Room Temp","Wired Controller"]
["FD","Heating + FCU","Fujitsu ","ELECTRIC UFH","YES","33 °C","Room Temp","Wired Controller"]
["FD","Heating + FCU","Fujitsu ","ELECTRIC UFH","YES","34 °C","Room Temp","Wired Controller"]
["FD","Heating + FCU","Fujitsu ","ELECTRIC UFH","YES","35 °C","Room Temp","Wired Controller"]
["FD","Heating + FCU","Fujitsu ","ELECTRIC UFH","YES","36 °C","Room Temp","Wired Controller"]
["FD","Heating + FCU","Fujitsu ","ELECTRIC UFH","YES","37 °C","Room Temp","Wired Controller"]
["FD","Heating + FCU","Fujitsu ","ELECTRIC UFH","YES","38 °C","Room Temp","Wired Controller"]
["FD","Heating + FCU","Fujitsu ","ELECTRIC UFH","YES","39 °C","Room Temp","Wired Controller"]
["FD","Heating + FCU","Fujitsu ","ELECTRIC UFH","YES","40 °C","Room Temp","Wired Controller"]
["FD","Heating + FCU","Hitachi ","ELECTRIC UFH","YES","TBA","Room Temp","Wired Controller"]
["FD","Heating + FCU","Hitachi ","ELECTRIC UFH","YES","25 °C","Room Temp","Wired Controller"]
["FD","Heating + FCU","Hitachi ","ELECTRIC UFH","YES","26 °C","Room Temp","Wired Controller"]
["FD","Heating + FCU","Hitachi ","ELECTRIC UFH","YES","27 °C","Room Temp","Wired Controller"]
["FD","Heating + FCU","Hitachi ","ELECTRIC UFH","YES","28 °C","Room Temp","Wired Controller"]
["FD","Heating + FCU","Hitachi ","ELECTRIC UFH","YES","29 °C","Room Temp","Wired Controller"]
["FD","Heating + FCU","Hitachi ","ELECTRIC UFH","YES","30 °C","Room Temp","Wired Controller"]
["FD","Heating + FCU","Hitachi ","ELECTRIC UFH","YES","31 °C","Room Temp","Wired Controller"]
["FD","Heating + FCU","Hitachi ","ELECTRIC UFH","YES","32 °C","Room Temp","Wired Controller"]
["FD","Heating + FCU","Hitachi ","ELECTRIC UFH","YES","33 °C","Room Temp","Wired Controller"]
["FD","Heating + FCU","Hitachi ","ELECTRIC UFH","YES","34 °C","Room Temp","Wired Controller"]
["FD","Heating + FCU","Hitachi ","ELECTRIC UFH","YES","35 °C","Room Temp","Wired Controller"]
["FD","Heating + FCU","Hitachi ","ELECTRIC UFH","YES","36 °C","Room Temp","Wired Controller"]
["FD","Heating + FCU","Hitachi ","ELECTRIC UFH","YES","37 °C","Room Temp","Wired Controller"]
["FD","Heating + FCU","Hitachi ","ELECTRIC UFH","YES","38 °C","Room Temp","Wired Controller"]
["FD","Heating + FCU","Hitachi ","ELECTRIC UFH","YES","39 °C","Room Temp","Wired Controller"]
["FD","Heating + FCU","Hitachi ","ELECTRIC UFH","YES","40 °C","Room Temp","Wired Controller"]
["FD","Heating + FCU","LG","ELECTRIC UFH","YES","TBA","Room Temp","Wired Controller"]
["FD","Heating + FCU","LG","ELECTRIC UFH","YES","25 °C","Room Temp","Wired Controller"]
["FD","Heating + FCU","LG","ELECTRIC UFH","YES","26 °C","Room Temp","Wired Controller"]
["FD","Heating + FCU","LG","ELECTRIC UFH","YES","27 °C","Room Temp","Wired Controller"]
["FD","Heating + FCU","LG","ELECTRIC UFH","YES","28 °C","Room Temp","Wired Controller"]
["FD","Heating + FCU","LG","ELECTRIC UFH","YES","29 °C","Room Temp","Wired Controller"]
["FD","Heating + FCU","LG","ELECTRIC UFH","YES","30 °C","Room Temp","Wired Controller"]
["FD","Heating + FCU","LG","ELECTRIC UFH","YES","31 °C","Room Temp","Wired Controller"]
["FD","Heating + FCU","LG","ELECTRIC UFH","YES","32 °C","Room Temp","Wired Controller"]
["FD","Heating + FCU","LG","ELECTRIC UFH","YES","33 °C","Room Temp","Wired Controller"]
["FD","Heating + FCU","LG","ELECTRIC UFH","YES","34 °C","Room Temp","Wired Controller"]
["FD","Heating + FCU","LG","ELECTRIC UFH","YES","35 °C","Room Temp","Wired Controller"]
["FD","Heating + FCU","LG","ELECTRIC UFH","YES","36 °C","Room Temp","Wired Controller"]
["FD","Heating + FCU","LG","ELECTRIC UFH","YES","37 °C","Room Temp","Wired Controller"]
["FD","Heating + FCU","LG","ELECTRIC UFH","YES","38 °C","Room Temp","Wired Controller"]
["FD","Heating + FCU","LG","ELECTRIC UFH","YES","39 °C","Room Temp","Wired Controller"]
["FD","Heating + FCU","LG","ELECTRIC UFH","YES","40 °C","Room Temp","Wired Controller"]
["FD","Heating + FCU","Other","ELECTRIC UFH","YES","TBA","Room Temp","Wired Controller"]
["FD","Heating + FCU","Other","ELECTRIC UFH","YES","25 °C","Room Temp","Wired Controller"]
["FD","Heating + FCU","Other","ELECTRIC UFH","YES","26 °C","Room Temp","Wired Controller"]
["FD","Heating + FCU","Other","ELECTRIC UFH","YES","27 °C","Room Temp","Wired Controller"]
["FD","Heating + FCU","Other","ELECTRIC UFH","YES","28 °C","Room Temp","Wired Controller"]
["FD","Heating + FCU","Other","ELECTRIC UFH","YES","29 °C","Room Temp","Wired Controller"]
["FD","Heating + FCU","Other","ELECTRIC UFH","YES","30 °C","Room Temp","Wired Controller"]
["FD","Heating + FCU","Other","ELECTRIC UFH","YES","31 °C","Room Temp","Wired Controller"]
["FD","Heating + FCU","Other","ELECTRIC UFH","YES","32 °C","Room Temp","Wired Controller"]
["FD","Heating + FCU","Other","ELECTRIC UFH","YES","33 °C","Room Temp","Wired Controller"]
["FD","Heating + FCU","Other","ELECTRIC UFH","YES","34 °C","Room Temp","Wired Controller"]
["FD","Heating + FCU","Other","ELECTRIC UFH","YES","35 °C","Room Temp","Wired Controller"]
["FD","Heating + FCU","Other","ELECTRIC UFH","YES","36 °C","Room Temp","Wired Controller"]
["FD","Heating + FCU","Other","ELECTRIC UFH","YES","37 °C","Room Temp","Wired Controller"]
["FD","Heating + FCU","Other","ELECTRIC UFH","YES","38 °C","Room Temp","Wired Controller"]
["FD","Heating + FCU","Other","ELECTRIC UFH","YES","39 °C","Room Temp","Wired Controller"]
["FD","Heating + FCU","Other","ELECTRIC UFH","YES","40 °C","Room Temp","Wired Controller"]
["FE","Heating + FCU","PLEASE SELECT","RADIATOR","N/A","N/A","Room Temp","Wired Controller"]
["FE","Heating + FCU","Daikin","RADIATOR","N/A","N/A","Room Temp","Wired Controller"]
["FE","Heating + FCU","Mitsubishi","RADIATOR","N/A","N/A","Room Temp","Wired Controller"]
["FE","Heating + FCU","Toshiba","RADIATOR","N/A","N/A","Room Temp","Wired Controller"]
["FE","Heating + FCU","Sanyo ","RADIATOR","N/A","N/A","Room Temp","Wired Controller"]
["FE","Heating + FCU","Panasonic ","RADIATOR","N/A","N/A","Room Temp","Wired Controller"]
["FE","Heating + FCU","Fujitsu ","RADIATOR","N/A","N/A","Room Temp","Wired Controller"]
["FE","Heating + FCU","Hitachi ","RADIATOR","N/A","N/A","Room Temp","Wired Controller"]
["FE","Heating + FCU","LG","RADIATOR","N/A","N/A","Room Temp","Wired Controller"]
["FE","Heating + FCU","Other","RADIATOR","N/A","N/A","Room Temp","Wired Controller"]
["FF","FCU Only","PLEASE SELECT","N/A","N/A","N/A","Room Temp","Wired Controller"]
["FF","FCU Only","Daikin","N/A","N/A","N/A","Room Temp","Wired Controller"]
["FF","FCU Only","Mitsubishi","N/A","N/A","N/A","Room Temp","Wired Controller"]
["FF","FCU Only","Toshiba","N/A","N/A","N/A","Room Temp","Wired Controller"]
["FF","FCU Only","Sanyo ","N/A","N/A","N/A","Room Temp","Wired Controller"]
["FF","FCU Only","Panasonic ","N/A","N/A","N/A","Room Temp","Wired Controller"]
["FF","FCU Only","Fujitsu ","N/A","N/A","N/A","Room Temp","Wired Controller"]
["FF","FCU Only","Hitachi ","N/A","N/A","N/A","Room Temp","Wired Controller"]
["FF","FCU Only","LG","N/A","N/A","N/A","Room Temp","Wired Controller"]
["FF","FCU Only","Other","N/A","N/A","N/A","Room Temp","Wired Controller"]
["FAB","Heating + FCU","PLEASE SELECT","WET UFH","NO","N/A","Room Temp","ClimateSync Room Sensor"]
["FAB","Heating + FCU","Daikin","WET UFH","NO","N/A","Room Temp","ClimateSync Room Sensor"]
["FAB","Heating + FCU","Mitsubishi","WET UFH","NO","N/A","Room Temp","ClimateSync Room Sensor"]
["FAB","Heating + FCU","Toshiba","WET UFH","NO","N/A","Room Temp","ClimateSync Room Sensor"]
["FAB","Heating + FCU","Sanyo ","WET UFH","NO","N/A","Room Temp","ClimateSync Room Sensor"]
["FAB","Heating + FCU","Panasonic ","WET UFH","NO","N/A","Room Temp","ClimateSync Room Sensor"]
["FAB","Heating + FCU","Fujitsu ","WET UFH","NO","N/A","Room Temp","ClimateSync Room Sensor"]
["FAB","Heating + FCU","Hitachi ","WET UFH","NO","N/A","Room Temp","ClimateSync Room Sensor"]
["FAB","Heating + FCU","LG","WET UFH","NO","N/A","Room Temp","ClimateSync Room Sensor"]
["FAB","Heating + FCU","Other","WET UFH","NO","N/A","Room Temp","ClimateSync Room Sensor"]
["FBB","Heating + FCU","PLEASE SELECT","WET UFH","YES","PLEASE SELECT","Room Temp","ClimateSync Room Sensor"]
["FBB","Heating + FCU","Daikin","WET UFH","YES","TBA","Room Temp","ClimateSync Room Sensor"]
["FBB","Heating + FCU","Daikin","WET UFH","YES","25 °C","Room Temp","ClimateSync Room Sensor"]
["FBB","Heating + FCU","Daikin","WET UFH","YES","26 °C","Room Temp","ClimateSync Room Sensor"]
["FBB","Heating + FCU","Daikin","WET UFH","YES","27 °C","Room Temp","ClimateSync Room Sensor"]
["FBB","Heating + FCU","Daikin","WET UFH","YES","28 °C","Room Temp","ClimateSync Room Sensor"]
["FBB","Heating + FCU","Daikin","WET UFH","YES","29 °C","Room Temp","ClimateSync Room Sensor"]
["FBB","Heating + FCU","Daikin","WET UFH","YES","30 °C","Room Temp","ClimateSync Room Sensor"]
["FBB","Heating + FCU","Daikin","WET UFH","YES","31 °C","Room Temp","ClimateSync Room Sensor"]
["FBB","Heating + FCU","Daikin","WET UFH","YES","32 °C","Room Temp","ClimateSync Room Sensor"]
["FBB","Heating + FCU","Daikin","WET UFH","YES","33 °C","Room Temp","ClimateSync Room Sensor"]
["FBB","Heating + FCU","Daikin","WET UFH","YES","34 °C","Room Temp","ClimateSync Room Sensor"]
["FBB","Heating + FCU","Daikin","WET UFH","YES","35 °C","Room Temp","ClimateSync Room Sensor"]
["FBB","Heating + FCU","Daikin","WET UFH","YES","36 °C","Room Temp","ClimateSync Room Sensor"]
["FBB","Heating + FCU","Daikin","WET UFH","YES","37 °C","Room Temp","ClimateSync Room Sensor"]
["FBB","Heating + FCU","Daikin","WET UFH","YES","38 °C","Room Temp","ClimateSync Room Sensor"]
["FBB","Heating + FCU","Daikin","WET UFH","YES","39 °C","Room Temp","ClimateSync Room Sensor"]
["FBB","Heating + FCU","Daikin","WET UFH","YES","40 °C","Room Temp","ClimateSync Room Sensor"]
["FBB","Heating + FCU","Mitsubishi","WET UFH","YES","TBA","Room Temp","ClimateSync Room Sensor"]
["FBB","Heating + FCU","Mitsubishi","WET UFH","YES","25 °C","Room Temp","ClimateSync Room Sensor"]
["FBB","Heating + FCU","Mitsubishi","WET UFH","YES","26 °C","Room Temp","ClimateSync Room Sensor"]
["FBB","Heating + FCU","Mitsubishi","WET UFH","YES","27 °C","Room Temp","ClimateSync Room Sensor"]
["FBB","Heating + FCU","Mitsubishi","WET UFH","YES","28 °C","Room Temp","ClimateSync Room Sensor"]
["FBB","Heating + FCU","Mitsubishi","WET UFH","YES","29 °C","Room Temp","ClimateSync Room Sensor"]
["FBB","Heating + FCU","Mitsubishi","WET UFH","YES","30 °C","Room Temp","ClimateSync Room Sensor"]
["FBB","Heating + FCU","Mitsubishi","WET UFH","YES","31 °C","Room Temp","ClimateSync Room Sensor"]
["FBB","Heating + FCU","Mitsubishi","WET UFH","YES","32 °C","Room Temp","ClimateSync Room Sensor"]
["FBB","Heating + FCU","Mitsubishi","WET UFH","YES","33 °C","Room Temp","ClimateSync Room Sensor"]
["FBB","Heating + FCU","Mitsubishi","WET UFH","YES","34 °C","Room Temp","ClimateSync Room Sensor"]
["FBB","Heating + FCU","Mitsubishi","WET UFH","YES","35 °C","Room Temp","ClimateSync Room Sensor"]
["FBB","Heating + FCU","Mitsubishi","WET UFH","YES","36 °C","Room Temp","ClimateSync Room Sensor"]
["FBB","Heating + FCU","Mitsubishi","WET UFH","YES","37 °C","Room Temp","ClimateSync Room Sensor"]
["FBB","Heating + FCU","Mitsubishi","WET UFH","YES","38 °C","Room Temp","ClimateSync Room Sensor"]
["FBB","Heating + FCU","Mitsubishi","WET UFH","YES","39 °C","Room Temp","ClimateSync Room Sensor"]
["FBB","Heating + FCU","Mitsubishi","WET UFH","YES","40 °C","Room Temp","ClimateSync Room Sensor"]
["FBB","Heating + FCU","Toshiba","WET UFH","YES","TBA","Room Temp","ClimateSync Room Sensor"]
["FBB","Heating + FCU","Toshiba","WET UFH","YES","25 °C","Room Temp","ClimateSync Room Sensor"]
["FBB","Heating + FCU","Toshiba","WET UFH","YES","26 °C","Room Temp","ClimateSync Room Sensor"]
["FBB","Heating + FCU","Toshiba","WET UFH","YES","27 °C","Room Temp","ClimateSync Room Sensor"]
["FBB","Heating + FCU","Toshiba","WET UFH","YES","28 °C","Room Temp","ClimateSync Room Sensor"]
["FBB","Heating + FCU","Toshiba","WET UFH","YES","29 °C","Room Temp","ClimateSync Room Sensor"]
["FBB","Heating + FCU","Toshiba","WET UFH","YES","30 °C","Room Temp","ClimateSync Room Sensor"]
["FBB","Heating + FCU","Toshiba","WET UFH","YES","31 °C","Room Temp","ClimateSync Room Sensor"]
["FBB","Heating + FCU","Toshiba","WET UFH","YES","32 °C","Room Temp","ClimateSync Room Sensor"]
["FBB","Heating + FCU","Toshiba","WET UFH","YES","33 °C","Room Temp","ClimateSync Room Sensor"]
["FBB","Heating + FCU","Toshiba","WET UFH","YES","34 °C","Room Temp","ClimateSync Room Sensor"]
["FBB","Heating + FCU","Toshiba","WET UFH","YES","35 °C","Room Temp","ClimateSync Room Sensor"]
["FBB","Heating + FCU","Toshiba","WET UFH","YES","36 °C","Room Temp","ClimateSync Room Sensor"]
["FBB","Heating + FCU","Toshiba","WET UFH","YES","37 °C","Room Temp","ClimateSync Room Sensor"]
["FBB","Heating + FCU","Toshiba","WET UFH","YES","38 °C","Room Temp","ClimateSync Room Sensor"]
["FBB","Heating + FCU","Toshiba","WET UFH","YES","39 °C","Room Temp","ClimateSync Room Sensor"]
["FBB","Heating + FCU","Toshiba","WET UFH","YES","40 °C","Room Temp","ClimateSync Room Sensor"]
["FBB","Heating + FCU","Sanyo ","WET UFH","YES","TBA","Room Temp","ClimateSync Room Sensor"]
["FBB","Heating + FCU","Sanyo ","WET UFH","YES","25 °C","Room Temp","ClimateSync Room Sensor"]
["FBB","Heating + FCU","Sanyo ","WET UFH","YES","26 °C","Room Temp","ClimateSync Room Sensor"]
["FBB","Heating + FCU","Sanyo ","WET UFH","YES","27 °C","Room Temp","ClimateSync Room Sensor"]
["FBB","Heating + FCU","Sanyo ","WET UFH","YES","28 °C","Room Temp","ClimateSync Room Sensor"]
["FBB","Heating + FCU","Sanyo ","WET UFH","YES","29 °C","Room Temp","ClimateSync Room Sensor"]
["FBB","Heating + FCU","Sanyo ","WET UFH","YES","30 °C","Room Temp","ClimateSync Room Sensor"]
["FBB","Heating + FCU","Sanyo ","WET UFH","YES","31 °C","Room Temp","ClimateSync Room Sensor"]
["FBB","Heating + FCU","Sanyo ","WET UFH","YES","32 °C","Room Temp","ClimateSync Room Sensor"]
["FBB","Heating + FCU","Sanyo ","WET UFH","YES","33 °C","Room Temp","ClimateSync Room Sensor"]
["FBB","Heating + FCU","Sanyo ","WET UFH","YES","34 °C","Room Temp","ClimateSync Room Sensor"]
["FBB","Heating + FCU","Sanyo ","WET UFH","YES","35 °C","Room Temp","ClimateSync Room Sensor"]
["FBB","Heating + FCU","Sanyo ","WET UFH","YES","36 °C","Room Temp","ClimateSync Room Sensor"]
["FBB","Heating + FCU","Sanyo ","WET UFH","YES","37 °C","Room Temp","ClimateSync Room Sensor"]
["FBB","Heating + FCU","Sanyo ","WET UFH","YES","38 °C","Room Temp","ClimateSync Room Sensor"]
["FBB","Heating + FCU","Sanyo ","WET UFH","YES","39 °C","Room Temp","ClimateSync Room Sensor"]
["FBB","Heating + FCU","Sanyo ","WET UFH","YES","40 °C","Room Temp","ClimateSync Room Sensor"]
["FBB","Heating + FCU","Panasonic ","WET UFH","YES","TBA","Room Temp","ClimateSync Room Sensor"]
["FBB","Heating + FCU","Panasonic ","WET UFH","YES","25 °C","Room Temp","ClimateSync Room Sensor"]
["FBB","Heating + FCU","Panasonic ","WET UFH","YES","26 °C","Room Temp","ClimateSync Room Sensor"]
["FBB","Heating + FCU","Panasonic ","WET UFH","YES","27 °C","Room Temp","ClimateSync Room Sensor"]
["FBB","Heating + FCU","Panasonic ","WET UFH","YES","28 °C","Room Temp","ClimateSync Room Sensor"]
["FBB","Heating + FCU","Panasonic ","WET UFH","YES","29 °C","Room Temp","ClimateSync Room Sensor"]
["FBB","Heating + FCU","Panasonic ","WET UFH","YES","30 °C","Room Temp","ClimateSync Room Sensor"]
["FBB","Heating + FCU","Panasonic ","WET UFH","YES","31 °C","Room Temp","ClimateSync Room Sensor"]
["FBB","Heating + FCU","Panasonic ","WET UFH","YES","32 °C","Room Temp","ClimateSync Room Sensor"]
["FBB","Heating + FCU","Panasonic ","WET UFH","YES","33 °C","Room Temp","ClimateSync Room Sensor"]
["FBB","Heating + FCU","Panasonic ","WET UFH","YES","34 °C","Room Temp","ClimateSync Room Sensor"]
["FBB","Heating + FCU","Panasonic ","WET UFH","YES","35 °C","Room Temp","ClimateSync Room Sensor"]
["FBB","Heating + FCU","Panasonic ","WET UFH","YES","36 °C","Room Temp","ClimateSync Room Sensor"]
["FBB","Heating + FCU","Panasonic ","WET UFH","YES","37 °C","Room Temp","ClimateSync Room Sensor"]
["FBB","Heating + FCU","Panasonic ","WET UFH","YES","38 °C","Room Temp","ClimateSync Room Sensor"]
["FBB","Heating + FCU","Panasonic ","WET UFH","YES","39 °C","Room Temp","ClimateSync Room Sensor"]
["FBB","Heating + FCU","Panasonic ","WET UFH","YES","40 °C","Room Temp","ClimateSync Room Sensor"]
["FBB","Heating + FCU","Fujitsu ","WET UFH","YES","TBA","Room Temp","ClimateSync Room Sensor"]
["FBB","Heating + FCU","Fujitsu ","WET UFH","YES","25 °C","Room Temp","ClimateSync Room Sensor"]
["FBB","Heating + FCU","Fujitsu ","WET UFH","YES","26 °C","Room Temp","ClimateSync Room Sensor"]
["FBB","Heating + FCU","Fujitsu ","WET UFH","YES","27 °C","Room Temp","ClimateSync Room Sensor"]
["FBB","Heating + FCU","Fujitsu ","WET UFH","YES","28 °C","Room Temp","ClimateSync Room Sensor"]
["FBB","Heating + FCU","Fujitsu ","WET UFH","YES","29 °C","Room Temp","ClimateSync Room Sensor"]
["FBB","Heating + FCU","Fujitsu ","WET UFH","YES","30 °C","Room Temp","ClimateSync Room Sensor"]
["FBB","Heating + FCU","Fujitsu ","WET UFH","YES","31 °C","Room Temp","ClimateSync Room Sensor"]
["FBB","Heating + FCU","Fujitsu ","WET UFH","YES","32 °C","Room Temp","ClimateSync Room Sensor"]
["FBB","Heating + FCU","Fujitsu ","WET UFH","YES","33 °C","Room Temp","ClimateSync Room Sensor"]
["FBB","Heating + FCU","Fujitsu ","WET UFH","YES","34 °C","Room Temp","ClimateSync Room Sensor"]
["FBB","Heating + FCU","Fujitsu ","WET UFH","YES","35 °C","Room Temp","ClimateSync Room Sensor"]
["FBB","Heating + FCU","Fujitsu ","WET UFH","YES","36 °C","Room Temp","ClimateSync Room Sensor"]
["FBB","Heating + FCU","Fujitsu ","WET UFH","YES","37 °C","Room Temp","ClimateSync Room Sensor"]
["FBB","Heating + FCU","Fujitsu ","WET UFH","YES","38 °C","Room Temp","ClimateSync Room Sensor"]
["FBB","Heating + FCU","Fujitsu ","WET UFH","YES","39 °C","Room Temp","ClimateSync Room Sensor"]
["FBB","Heating + FCU","Fujitsu ","WET UFH","YES","40 °C","Room Temp","ClimateSync Room Sensor"]
["FBB","Heating + FCU","Hitachi ","WET UFH","YES","TBA","Room Temp","ClimateSync Room Sensor"]
["FBB","Heating + FCU","Hitachi ","WET UFH","YES","25 °C","Room Temp","ClimateSync Room Sensor"]
["FBB","Heating + FCU","Hitachi ","WET UFH","YES","26 °C","Room Temp","ClimateSync Room Sensor"]
["FBB","Heating + FCU","Hitachi ","WET UFH","YES","27 °C","Room Temp","ClimateSync Room Sensor"]
["FBB","Heating + FCU","Hitachi ","WET UFH","YES","28 °C","Room Temp","ClimateSync Room Sensor"]
["FBB","Heating + FCU","Hitachi ","WET UFH","YES","29 °C","Room Temp","ClimateSync Room Sensor"]
["FBB","Heating + FCU","Hitachi ","WET UFH","YES","30 °C","Room Temp","ClimateSync Room Sensor"]
["FBB","Heating + FCU","Hitachi ","WET UFH","YES","31 °C","Room Temp","ClimateSync Room Sensor"]
["FBB","Heating + FCU","Hitachi ","WET UFH","YES","32 °C","Room Temp","ClimateSync Room Sensor"]
["FBB","Heating + FCU","Hitachi ","WET UFH","YES","33 °C","Room Temp","ClimateSync Room Sensor"]
["FBB","Heating + FCU","Hitachi ","WET UFH","YES","34 °C","Room Temp","ClimateSync Room Sensor"]
["FBB","Heating + FCU","Hitachi ","WET UFH","YES","35 °C","Room Temp","ClimateSync Room Sensor"]
["FBB","Heating + FCU","Hitachi ","WET UFH","YES","36 °C","Room Temp","ClimateSync Room Sensor"]
["FBB","Heating + FCU","Hitachi ","WET UFH","YES","37 °C","Room Temp","ClimateSync Room Sensor"]
["FBB","Heating + FCU","Hitachi ","WET UFH","YES","38 °C","Room Temp","ClimateSync Room Sensor"]
["FBB","Heating + FCU","Hitachi ","WET UFH","YES","39 °C","Room Temp","ClimateSync Room Sensor"]
["FBB","Heating + FCU","Hitachi ","WET UFH","YES","40 °C","Room Temp","ClimateSync Room Sensor"]
["FBB","Heating + FCU","LG","WET UFH","YES","TBA","Room Temp","ClimateSync Room Sensor"]
["FBB","Heating + FCU","LG","WET UFH","YES","25 °C","Room Temp","ClimateSync Room Sensor"]
["FBB","Heating + FCU","LG","WET UFH","YES","26 °C","Room Temp","ClimateSync Room Sensor"]
["FBB","Heating + FCU","LG","WET UFH","YES","27 °C","Room Temp","ClimateSync Room Sensor"]
["FBB","Heating + FCU","LG","WET UFH","YES","28 °C","Room Temp","ClimateSync Room Sensor"]
["FBB","Heating + FCU","LG","WET UFH","YES","29 °C","Room Temp","ClimateSync Room Sensor"]
["FBB","Heating + FCU","LG","WET UFH","YES","30 °C","Room Temp","ClimateSync Room Sensor"]
["FBB","Heating + FCU","LG","WET UFH","YES","31 °C","Room Temp","ClimateSync Room Sensor"]
["FBB","Heating + FCU","LG","WET UFH","YES","32 °C","Room Temp","ClimateSync Room Sensor"]
["FBB","Heating + FCU","LG","WET UFH","YES","33 °C","Room Temp","ClimateSync Room Sensor"]
["FBB","Heating + FCU","LG","WET UFH","YES","34 °C","Room Temp","ClimateSync Room Sensor"]
["FBB","Heating + FCU","LG","WET UFH","YES","35 °C","Room Temp","ClimateSync Room Sensor"]
["FBB","Heating + FCU","LG","WET UFH","YES","36 °C","Room Temp","ClimateSync Room Sensor"]
["FBB","Heating + FCU","LG","WET UFH","YES","37 °C","Room Temp","ClimateSync Room Sensor"]
["FBB","Heating + FCU","LG","WET UFH","YES","38 °C","Room Temp","ClimateSync Room Sensor"]
["FBB","Heating + FCU","LG","WET UFH","YES","39 °C","Room Temp","ClimateSync Room Sensor"]
["FBB","Heating + FCU","LG","WET UFH","YES","40 °C","Room Temp","ClimateSync Room Sensor"]
["FBB","Heating + FCU","Other","WET UFH","YES","TBA","Room Temp","ClimateSync Room Sensor"]
["FBB","Heating + FCU","Other","WET UFH","YES","25 °C","Room Temp","ClimateSync Room Sensor"]
["FBB","Heating + FCU","Other","WET UFH","YES","26 °C","Room Temp","ClimateSync Room Sensor"]
["FBB","Heating + FCU","Other","WET UFH","YES","27 °C","Room Temp","ClimateSync Room Sensor"]
["FBB","Heating + FCU","Other","WET UFH","YES","28 °C","Room Temp","ClimateSync Room Sensor"]
["FBB","Heating + FCU","Other","WET UFH","YES","29 °C","Room Temp","ClimateSync Room Sensor"]
["FBB","Heating + FCU","Other","WET UFH","YES","30 °C","Room Temp","ClimateSync Room Sensor"]
["FBB","Heating + FCU","Other","WET UFH","YES","31 °C","Room Temp","ClimateSync Room Sensor"]
["FBB","Heating + FCU","Other","WET UFH","YES","32 °C","Room Temp","ClimateSync Room Sensor"]
["FBB","Heating + FCU","Other","WET UFH","YES","33 °C","Room Temp","ClimateSync Room Sensor"]
["FBB","Heating + FCU","Other","WET UFH","YES","34 °C","Room Temp","ClimateSync Room Sensor"]
["FBB","Heating + FCU","Other","WET UFH","YES","35 °C","Room Temp","ClimateSync Room Sensor"]
["FBB","Heating + FCU","Other","WET UFH","YES","36 °C","Room Temp","ClimateSync Room Sensor"]
["FBB","Heating + FCU","Other","WET UFH","YES","37 °C","Room Temp","ClimateSync Room Sensor"]
["FBB","Heating + FCU","Other","WET UFH","YES","38 °C","Room Temp","ClimateSync Room Sensor"]
["FBB","Heating + FCU","Other","WET UFH","YES","39 °C","Room Temp","ClimateSync Room Sensor"]
["FBB","Heating + FCU","Other","WET UFH","YES","40 °C","Room Temp","ClimateSync Room Sensor"]
["FCB","Heating + FCU","PLEASE SELECT","ELECTRIC UFH","NO","N/A","Room Temp","ClimateSync Room Sensor"]
["FCB","Heating + FCU","Daikin","ELECTRIC UFH","NO","N/A","Room Temp","ClimateSync Room Sensor"]
["FCB","Heating + FCU","Mitsubishi","ELECTRIC UFH","NO","N/A","Room Temp","ClimateSync Room Sensor"]
["FCB","Heating + FCU","Toshiba","ELECTRIC UFH","NO","N/A","Room Temp","ClimateSync Room Sensor"]
["FCB","Heating + FCU","Sanyo ","ELECTRIC UFH","NO","N/A","Room Temp","ClimateSync Room Sensor"]
["FCB","Heating + FCU","Panasonic ","ELECTRIC UFH","NO","N/A","Room Temp","ClimateSync Room Sensor"]
["FCB","Heating + FCU","Fujitsu ","ELECTRIC UFH","NO","N/A","Room Temp","ClimateSync Room Sensor"]
["FCB","Heating + FCU","Hitachi ","ELECTRIC UFH","NO","N/A","Room Temp","ClimateSync Room Sensor"]
["FCB","Heating + FCU","LG","ELECTRIC UFH","NO","N/A","Room Temp","ClimateSync Room Sensor"]
["FCB","Heating + FCU","Other","ELECTRIC UFH","NO","N/A","Room Temp","ClimateSync Room Sensor"]
["FDB","Heating + FCU","PLEASE SELECT","ELECTRIC UFH","YES","PLEASE SELECT","Room Temp","ClimateSync Room Sensor"]
["FDB","Heating + FCU","Daikin","ELECTRIC UFH","YES","TBA","Room Temp","ClimateSync Room Sensor"]
["FDB","Heating + FCU","Daikin","ELECTRIC UFH","YES","25 °C","Room Temp","ClimateSync Room Sensor"]
["FDB","Heating + FCU","Daikin","ELECTRIC UFH","YES","26 °C","Room Temp","ClimateSync Room Sensor"]
["FDB","Heating + FCU","Daikin","ELECTRIC UFH","YES","27 °C","Room Temp","ClimateSync Room Sensor"]
["FDB","Heating + FCU","Daikin","ELECTRIC UFH","YES","28 °C","Room Temp","ClimateSync Room Sensor"]
["FDB","Heating + FCU","Daikin","ELECTRIC UFH","YES","29 °C","Room Temp","ClimateSync Room Sensor"]
["FDB","Heating + FCU","Daikin","ELECTRIC UFH","YES","30 °C","Room Temp","ClimateSync Room Sensor"]
["FDB","Heating + FCU","Daikin","ELECTRIC UFH","YES","31 °C","Room Temp","ClimateSync Room Sensor"]
["FDB","Heating + FCU","Daikin","ELECTRIC UFH","YES","32 °C","Room Temp","ClimateSync Room Sensor"]
["FDB","Heating + FCU","Daikin","ELECTRIC UFH","YES","33 °C","Room Temp","ClimateSync Room Sensor"]
["FDB","Heating + FCU","Daikin","ELECTRIC UFH","YES","34 °C","Room Temp","ClimateSync Room Sensor"]
["FDB","Heating + FCU","Daikin","ELECTRIC UFH","YES","35 °C","Room Temp","ClimateSync Room Sensor"]
["FDB","Heating + FCU","Daikin","ELECTRIC UFH","YES","36 °C","Room Temp","ClimateSync Room Sensor"]
["FDB","Heating + FCU","Daikin","ELECTRIC UFH","YES","37 °C","Room Temp","ClimateSync Room Sensor"]
["FDB","Heating + FCU","Daikin","ELECTRIC UFH","YES","38 °C","Room Temp","ClimateSync Room Sensor"]
["FDB","Heating + FCU","Daikin","ELECTRIC UFH","YES","39 °C","Room Temp","ClimateSync Room Sensor"]
["FDB","Heating + FCU","Daikin","ELECTRIC UFH","YES","40 °C","Room Temp","ClimateSync Room Sensor"]
["FDB","Heating + FCU","Mitsubishi","ELECTRIC UFH","YES","TBA","Room Temp","ClimateSync Room Sensor"]
["FDB","Heating + FCU","Mitsubishi","ELECTRIC UFH","YES","25 °C","Room Temp","ClimateSync Room Sensor"]
["FDB","Heating + FCU","Mitsubishi","ELECTRIC UFH","YES","26 °C","Room Temp","ClimateSync Room Sensor"]
["FDB","Heating + FCU","Mitsubishi","ELECTRIC UFH","YES","27 °C","Room Temp","ClimateSync Room Sensor"]
["FDB","Heating + FCU","Mitsubishi","ELECTRIC UFH","YES","28 °C","Room Temp","ClimateSync Room Sensor"]
["FDB","Heating + FCU","Mitsubishi","ELECTRIC UFH","YES","29 °C","Room Temp","ClimateSync Room Sensor"]
["FDB","Heating + FCU","Mitsubishi","ELECTRIC UFH","YES","30 °C","Room Temp","ClimateSync Room Sensor"]
["FDB","Heating + FCU","Mitsubishi","ELECTRIC UFH","YES","31 °C","Room Temp","ClimateSync Room Sensor"]
["FDB","Heating + FCU","Mitsubishi","ELECTRIC UFH","YES","32 °C","Room Temp","ClimateSync Room Sensor"]
["FDB","Heating + FCU","Mitsubishi","ELECTRIC UFH","YES","33 °C","Room Temp","ClimateSync Room Sensor"]
["FDB","Heating + FCU","Mitsubishi","ELECTRIC UFH","YES","34 °C","Room Temp","ClimateSync Room Sensor"]
["FDB","Heating + FCU","Mitsubishi","ELECTRIC UFH","YES","35 °C","Room Temp","ClimateSync Room Sensor"]
["FDB","Heating + FCU","Mitsubishi","ELECTRIC UFH","YES","36 °C","Room Temp","ClimateSync Room Sensor"]
["FDB","Heating + FCU","Mitsubishi","ELECTRIC UFH","YES","37 °C","Room Temp","ClimateSync Room Sensor"]
["FDB","Heating + FCU","Mitsubishi","ELECTRIC UFH","YES","38 °C","Room Temp","ClimateSync Room Sensor"]
["FDB","Heating + FCU","Mitsubishi","ELECTRIC UFH","YES","39 °C","Room Temp","ClimateSync Room Sensor"]
["FDB","Heating + FCU","Mitsubishi","ELECTRIC UFH","YES","40 °C","Room Temp","ClimateSync Room Sensor"]
["FDB","Heating + FCU","Toshiba","ELECTRIC UFH","YES","TBA","Room Temp","ClimateSync Room Sensor"]
["FDB","Heating + FCU","Toshiba","ELECTRIC UFH","YES","25 °C","Room Temp","ClimateSync Room Sensor"]
["FDB","Heating + FCU","Toshiba","ELECTRIC UFH","YES","26 °C","Room Temp","ClimateSync Room Sensor"]
["FDB","Heating + FCU","Toshiba","ELECTRIC UFH","YES","27 °C","Room Temp","ClimateSync Room Sensor"]
["FDB","Heating + FCU","Toshiba","ELECTRIC UFH","YES","28 °C","Room Temp","ClimateSync Room Sensor"]
["FDB","Heating + FCU","Toshiba","ELECTRIC UFH","YES","29 °C","Room Temp","ClimateSync Room Sensor"]
["FDB","Heating + FCU","Toshiba","ELECTRIC UFH","YES","30 °C","Room Temp","ClimateSync Room Sensor"]
["FDB","Heating + FCU","Toshiba","ELECTRIC UFH","YES","31 °C","Room Temp","ClimateSync Room Sensor"]
["FDB","Heating + FCU","Toshiba","ELECTRIC UFH","YES","32 °C","Room Temp","ClimateSync Room Sensor"]
["FDB","Heating + FCU","Toshiba","ELECTRIC UFH","YES","33 °C","Room Temp","ClimateSync Room Sensor"]
["FDB","Heating + FCU","Toshiba","ELECTRIC UFH","YES","34 °C","Room Temp","ClimateSync Room Sensor"]
["FDB","Heating + FCU","Toshiba","ELECTRIC UFH","YES","35 °C","Room Temp","ClimateSync Room Sensor"]
["FDB","Heating + FCU","Toshiba","ELECTRIC UFH","YES","36 °C","Room Temp","ClimateSync Room Sensor"]
["FDB","Heating + FCU","Toshiba","ELECTRIC UFH","YES","37 °C","Room Temp","ClimateSync Room Sensor"]
["FDB","Heating + FCU","Toshiba","ELECTRIC UFH","YES","38 °C","Room Temp","ClimateSync Room Sensor"]
["FDB","Heating + FCU","Toshiba","ELECTRIC UFH","YES","39 °C","Room Temp","ClimateSync Room Sensor"]
["FDB","Heating + FCU","Toshiba","ELECTRIC UFH","YES","40 °C","Room Temp","ClimateSync Room Sensor"]
["FDB","Heating + FCU","Sanyo ","ELECTRIC UFH","YES","TBA","Room Temp","ClimateSync Room Sensor"]
["FDB","Heating + FCU","Sanyo ","ELECTRIC UFH","YES","25 °C","Room Temp","ClimateSync Room Sensor"]
["FDB","Heating + FCU","Sanyo ","ELECTRIC UFH","YES","26 °C","Room Temp","ClimateSync Room Sensor"]
["FDB","Heating + FCU","Sanyo ","ELECTRIC UFH","YES","27 °C","Room Temp","ClimateSync Room Sensor"]
["FDB","Heating + FCU","Sanyo ","ELECTRIC UFH","YES","28 °C","Room Temp","ClimateSync Room Sensor"]
["FDB","Heating + FCU","Sanyo ","ELECTRIC UFH","YES","29 °C","Room Temp","ClimateSync Room Sensor"]
["FDB","Heating + FCU","Sanyo ","ELECTRIC UFH","YES","30 °C","Room Temp","ClimateSync Room Sensor"]
["FDB","Heating + FCU","Sanyo ","ELECTRIC UFH","YES","31 °C","Room Temp","ClimateSync Room Sensor"]
["FDB","Heating + FCU","Sanyo ","ELECTRIC UFH","YES","32 °C","Room Temp","ClimateSync Room Sensor"]
["FDB","Heating + FCU","Sanyo ","ELECTRIC UFH","YES","33 °C","Room Temp","ClimateSync Room Sensor"]
["FDB","Heating + FCU","Sanyo ","ELECTRIC UFH","YES","34 °C","Room Temp","ClimateSync Room Sensor"]
["FDB","Heating + FCU","Sanyo ","ELECTRIC UFH","YES","35 °C","Room Temp","ClimateSync Room Sensor"]
["FDB","Heating + FCU","Sanyo ","ELECTRIC UFH","YES","36 °C","Room Temp","ClimateSync Room Sensor"]
["FDB","Heating + FCU","Sanyo ","ELECTRIC UFH","YES","37 °C","Room Temp","ClimateSync Room Sensor"]
["FDB","Heating + FCU","Sanyo ","ELECTRIC UFH","YES","38 °C","Room Temp","ClimateSync Room Sensor"]
["FDB","Heating + FCU","Sanyo ","ELECTRIC UFH","YES","39 °C","Room Temp","ClimateSync Room Sensor"]
["FDB","Heating + FCU","Sanyo ","ELECTRIC UFH","YES","40 °C","Room Temp","ClimateSync Room Sensor"]
["FDB","Heating + FCU","Panasonic ","ELECTRIC UFH","YES","TBA","Room Temp","ClimateSync Room Sensor"]
["FDB","Heating + FCU","Panasonic ","ELECTRIC UFH","YES","25 °C","Room Temp","ClimateSync Room Sensor"]
["FDB","Heating + FCU","Panasonic ","ELECTRIC UFH","YES","26 °C","Room Temp","ClimateSync Room Sensor"]
["FDB","Heating + FCU","Panasonic ","ELECTRIC UFH","YES","27 °C","Room Temp","ClimateSync Room Sensor"]
["FDB","Heating + FCU","Panasonic ","ELECTRIC UFH","YES","28 °C","Room Temp","ClimateSync Room Sensor"]
["FDB","Heating + FCU","Panasonic ","ELECTRIC UFH","YES","29 °C","Room Temp","ClimateSync Room Sensor"]
["FDB","Heating + FCU","Panasonic ","ELECTRIC UFH","YES","30 °C","Room Temp","ClimateSync Room Sensor"]
["FDB","Heating + FCU","Panasonic ","ELECTRIC UFH","YES","31 °C","Room Temp","ClimateSync Room Sensor"]
["FDB","Heating + FCU","Panasonic ","ELECTRIC UFH","YES","32 °C","Room Temp","ClimateSync Room Sensor"]
["FDB","Heating + FCU","Panasonic ","ELECTRIC UFH","YES","33 °C","Room Temp","ClimateSync Room Sensor"]
["FDB","Heating + FCU","Panasonic ","ELECTRIC UFH","YES","34 °C","Room Temp","ClimateSync Room Sensor"]
["FDB","Heating + FCU","Panasonic ","ELECTRIC UFH","YES","35 °C","Room Temp","ClimateSync Room Sensor"]
["FDB","Heating + FCU","Panasonic ","ELECTRIC UFH","YES","36 °C","Room Temp","ClimateSync Room Sensor"]
["FDB","Heating + FCU","Panasonic ","ELECTRIC UFH","YES","37 °C","Room Temp","ClimateSync Room Sensor"]
["FDB","Heating + FCU","Panasonic ","ELECTRIC UFH","YES","38 °C","Room Temp","ClimateSync Room Sensor"]
["FDB","Heating + FCU","Panasonic ","ELECTRIC UFH","YES","39 °C","Room Temp","ClimateSync Room Sensor"]
["FDB","Heating + FCU","Panasonic ","ELECTRIC UFH","YES","40 °C","Room Temp","ClimateSync Room Sensor"]
["FDB","Heating + FCU","Fujitsu ","ELECTRIC UFH","YES","TBA","Room Temp","ClimateSync Room Sensor"]
["FDB","Heating + FCU","Fujitsu ","ELECTRIC UFH","YES","25 °C","Room Temp","ClimateSync Room Sensor"]
["FDB","Heating + FCU","Fujitsu ","ELECTRIC UFH","YES","26 °C","Room Temp","ClimateSync Room Sensor"]
["FDB","Heating + FCU","Fujitsu ","ELECTRIC UFH","YES","27 °C","Room Temp","ClimateSync Room Sensor"]
["FDB","Heating + FCU","Fujitsu ","ELECTRIC UFH","YES","28 °C","Room Temp","ClimateSync Room Sensor"]
["FDB","Heating + FCU","Fujitsu ","ELECTRIC UFH","YES","29 °C","Room Temp","ClimateSync Room Sensor"]
["FDB","Heating + FCU","Fujitsu ","ELECTRIC UFH","YES","30 °C","Room Temp","ClimateSync Room Sensor"]
["FDB","Heating + FCU","Fujitsu ","ELECTRIC UFH","YES","31 °C","Room Temp","ClimateSync Room Sensor"]
["FDB","Heating + FCU","Fujitsu ","ELECTRIC UFH","YES","32 °C","Room Temp","ClimateSync Room Sensor"]
["FDB","Heating + FCU","Fujitsu ","ELECTRIC UFH","YES","33 °C","Room Temp","ClimateSync Room Sensor"]
["FDB","Heating + FCU","Fujitsu ","ELECTRIC UFH","YES","34 °C","Room Temp","ClimateSync Room Sensor"]
["FDB","Heating + FCU","Fujitsu ","ELECTRIC UFH","YES","35 °C","Room Temp","ClimateSync Room Sensor"]
["FDB","Heating + FCU","Fujitsu ","ELECTRIC UFH","YES","36 °C","Room Temp","ClimateSync Room Sensor"]
["FDB","Heating + FCU","Fujitsu ","ELECTRIC UFH","YES","37 °C","Room Temp","ClimateSync Room Sensor"]
["FDB","Heating + FCU","Fujitsu ","ELECTRIC UFH","YES","38 °C","Room Temp","ClimateSync Room Sensor"]
["FDB","Heating + FCU","Fujitsu ","ELECTRIC UFH","YES","39 °C","Room Temp","ClimateSync Room Sensor"]
["FDB","Heating + FCU","Fujitsu ","ELECTRIC UFH","YES","40 °C","Room Temp","ClimateSync Room Sensor"]
["FDB","Heating + FCU","Hitachi ","ELECTRIC UFH","YES","TBA","Room Temp","ClimateSync Room Sensor"]
["FDB","Heating + FCU","Hitachi ","ELECTRIC UFH","YES","25 °C","Room Temp","ClimateSync Room Sensor"]
["FDB","Heating + FCU","Hitachi ","ELECTRIC UFH","YES","26 °C","Room Temp","ClimateSync Room Sensor"]
["FDB","Heating + FCU","Hitachi ","ELECTRIC UFH","YES","27 °C","Room Temp","ClimateSync Room Sensor"]
["FDB","Heating + FCU","Hitachi ","ELECTRIC UFH","YES","28 °C","Room Temp","ClimateSync Room Sensor"]
["FDB","Heating + FCU","Hitachi ","ELECTRIC UFH","YES","29 °C","Room Temp","ClimateSync Room Sensor"]
["FDB","Heating + FCU","Hitachi ","ELECTRIC UFH","YES","30 °C","Room Temp","ClimateSync Room Sensor"]
["FDB","Heating + FCU","Hitachi ","ELECTRIC UFH","YES","31 °C","Room Temp","ClimateSync Room Sensor"]
["FDB","Heating + FCU","Hitachi ","ELECTRIC UFH","YES","32 °C","Room Temp","ClimateSync Room Sensor"]
["FDB","Heating + FCU","Hitachi ","ELECTRIC UFH","YES","33 °C","Room Temp","ClimateSync Room Sensor"]
["FDB","Heating + FCU","Hitachi ","ELECTRIC UFH","YES","34 °C","Room Temp","ClimateSync Room Sensor"]
["FDB","Heating + FCU","Hitachi ","ELECTRIC UFH","YES","35 °C","Room Temp","ClimateSync Room Sensor"]
["FDB","Heating + FCU","Hitachi ","ELECTRIC UFH","YES","36 °C","Room Temp","ClimateSync Room Sensor"]
["FDB","Heating + FCU","Hitachi ","ELECTRIC UFH","YES","37 °C","Room Temp","ClimateSync Room Sensor"]
["FDB","Heating + FCU","Hitachi ","ELECTRIC UFH","YES","38 °C","Room Temp","ClimateSync Room Sensor"]
["FDB","Heating + FCU","Hitachi ","ELECTRIC UFH","YES","39 °C","Room Temp","ClimateSync Room Sensor"]
["FDB","Heating + FCU","Hitachi ","ELECTRIC UFH","YES","40 °C","Room Temp","ClimateSync Room Sensor"]
["FDB","Heating + FCU","LG","ELECTRIC UFH","YES","TBA","Room Temp","ClimateSync Room Sensor"]
["FDB","Heating + FCU","LG","ELECTRIC UFH","YES","25 °C","Room Temp","ClimateSync Room Sensor"]
["FDB","Heating + FCU","LG","ELECTRIC UFH","YES","26 °C","Room Temp","ClimateSync Room Sensor"]
["FDB","Heating + FCU","LG","ELECTRIC UFH","YES","27 °C","Room Temp","ClimateSync Room Sensor"]
["FDB","Heating + FCU","LG","ELECTRIC UFH","YES","28 °C","Room Temp","ClimateSync Room Sensor"]
["FDB","Heating + FCU","LG","ELECTRIC UFH","YES","29 °C","Room Temp","ClimateSync Room Sensor"]
["FDB","Heating + FCU","LG","ELECTRIC UFH","YES","30 °C","Room Temp","ClimateSync Room Sensor"]
["FDB","Heating + FCU","LG","ELECTRIC UFH","YES","31 °C","Room Temp","ClimateSync Room Sensor"]
["FDB","Heating + FCU","LG","ELECTRIC UFH","YES","32 °C","Room Temp","ClimateSync Room Sensor"]
["FDB","Heating + FCU","LG","ELECTRIC UFH","YES","33 °C","Room Temp","ClimateSync Room Sensor"]
["FDB","Heating + FCU","LG","ELECTRIC UFH","YES","34 °C","Room Temp","ClimateSync Room Sensor"]
["FDB","Heating + FCU","LG","ELECTRIC UFH","YES","35 °C","Room Temp","ClimateSync Room Sensor"]
["FDB","Heating + FCU","LG","ELECTRIC UFH","YES","36 °C","Room Temp","ClimateSync Room Sensor"]
["FDB","Heating + FCU","LG","ELECTRIC UFH","YES","37 °C","Room Temp","ClimateSync Room Sensor"]
["FDB","Heating + FCU","LG","ELECTRIC UFH","YES","38 °C","Room Temp","ClimateSync Room Sensor"]
["FDB","Heating + FCU","LG","ELECTRIC UFH","YES","39 °C","Room Temp","ClimateSync Room Sensor"]
["FDB","Heating + FCU","LG","ELECTRIC UFH","YES","40 °C","Room Temp","ClimateSync Room Sensor"]
["FDB","Heating + FCU","Other","ELECTRIC UFH","YES","TBA","Room Temp","ClimateSync Room Sensor"]
["FDB","Heating + FCU","Other","ELECTRIC UFH","YES","25 °C","Room Temp","ClimateSync Room Sensor"]
["FDB","Heating + FCU","Other","ELECTRIC UFH","YES","26 °C","Room Temp","ClimateSync Room Sensor"]
["FDB","Heating + FCU","Other","ELECTRIC UFH","YES","27 °C","Room Temp","ClimateSync Room Sensor"]
["FDB","Heating + FCU","Other","ELECTRIC UFH","YES","28 °C","Room Temp","ClimateSync Room Sensor"]
["FDB","Heating + FCU","Other","ELECTRIC UFH","YES","29 °C","Room Temp","ClimateSync Room Sensor"]
["FDB","Heating + FCU","Other","ELECTRIC UFH","YES","30 °C","Room Temp","ClimateSync Room Sensor"]
["FDB","Heating + FCU","Other","ELECTRIC UFH","YES","31 °C","Room Temp","ClimateSync Room Sensor"]
["FDB","Heating + FCU","Other","ELECTRIC UFH","YES","32 °C","Room Temp","ClimateSync Room Sensor"]
["FDB","Heating + FCU","Other","ELECTRIC UFH","YES","33 °C","Room Temp","ClimateSync Room Sensor"]
["FDB","Heating + FCU","Other","ELECTRIC UFH","YES","34 °C","Room Temp","ClimateSync Room Sensor"]
["FDB","Heating + FCU","Other","ELECTRIC UFH","YES","35 °C","Room Temp","ClimateSync Room Sensor"]
["FDB","Heating + FCU","Other","ELECTRIC UFH","YES","36 °C","Room Temp","ClimateSync Room Sensor"]
["FDB","Heating + FCU","Other","ELECTRIC UFH","YES","37 °C","Room Temp","ClimateSync Room Sensor"]
["FDB","Heating + FCU","Other","ELECTRIC UFH","YES","38 °C","Room Temp","ClimateSync Room Sensor"]
["FDB","Heating + FCU","Other","ELECTRIC UFH","YES","39 °C","Room Temp","ClimateSync Room Sensor"]
["FDB","Heating + FCU","Other","ELECTRIC UFH","YES","40 °C","Room Temp","ClimateSync Room Sensor"]
["FEB","Heating + FCU","PLEASE SELECT","RADIATOR","N/A","N/A","Room Temp","ClimateSync Room Sensor"]
["FEB","Heating + FCU","Daikin","RADIATOR","N/A","N/A","Room Temp","ClimateSync Room Sensor"]
["FEB","Heating + FCU","Mitsubishi","RADIATOR","N/A","N/A","Room Temp","ClimateSync Room Sensor"]
["FEB","Heating + FCU","Toshiba","RADIATOR","N/A","N/A","Room Temp","ClimateSync Room Sensor"]
["FEB","Heating + FCU","Sanyo ","RADIATOR","N/A","N/A","Room Temp","ClimateSync Room Sensor"]
["FEB","Heating + FCU","Panasonic ","RADIATOR","N/A","N/A","Room Temp","ClimateSync Room Sensor"]
["FEB","Heating + FCU","Fujitsu ","RADIATOR","N/A","N/A","Room Temp","ClimateSync Room Sensor"]
["FEB","Heating + FCU","Hitachi ","RADIATOR","N/A","N/A","Room Temp","ClimateSync Room Sensor"]
["FEB","Heating + FCU","LG","RADIATOR","N/A","N/A","Room Temp","ClimateSync Room Sensor"]
["FEB","Heating + FCU","Other","RADIATOR","N/A","N/A","Room Temp","ClimateSync Room Sensor"]
["FFB","FCU Only","PLEASE SELECT","N/A","N/A","N/A","Room Temp","ClimateSync Room Sensor"]
["FFB","FCU Only","Daikin","N/A","N/A","N/A","Room Temp","ClimateSync Room Sensor"]
["FFB","FCU Only","Mitsubishi","N/A","N/A","N/A","Room Temp","ClimateSync Room Sensor"]
["FFB","FCU Only","Toshiba","N/A","N/A","N/A","Room Temp","ClimateSync Room Sensor"]
["FFB","FCU Only","Sanyo ","N/A","N/A","N/A","Room Temp","ClimateSync Room Sensor"]
["FFB","FCU Only","Panasonic ","N/A","N/A","N/A","Room Temp","ClimateSync Room Sensor"]
["FFB","FCU Only","Fujitsu ","N/A","N/A","N/A","Room Temp","ClimateSync Room Sensor"]
["FFB","FCU Only","Hitachi ","N/A","N/A","N/A","Room Temp","ClimateSync Room Sensor"]
["FFB","FCU Only","LG","N/A","N/A","N/A","Room Temp","ClimateSync Room Sensor"]
["FFB","FCU Only","Other","N/A","N/A","N/A","Room Temp","ClimateSync Room Sensor"]

{"sheet":"SpillACB","index":4,"n_rows":309,"n_cols":10,"rows_kept":309,"hidden":true}
["Dependant Dropdown Spill List"]
["Horizontal Spill for AC/FCU Brands"]
[{"$f":"TRANSPOSE(_xlfn.UNIQUE(_xlfn._xlws.FILTER(ct_01[AC/FCU Brand],ct_01[Zone Application Type]=ZoneTypes!G3,\"\")))","v":"PLEASE SELECT"},"Daikin","Mitsubishi","Toshiba","Sanyo ","Panasonic ","Fujitsu ","Hitachi ","LG","Other"]
[{"$f":"TRANSPOSE(_xlfn.UNIQUE(_xlfn._xlws.FILTER(ct_01[AC/FCU Brand],ct_01[Zone Application Type]=ZoneTypes!G4,\"\")))","v":"PLEASE SELECT"},"Daikin","Mitsubishi","Toshiba","Sanyo ","Panasonic ","Fujitsu ","Hitachi ","LG","Other"]
[{"$f":"TRANSPOSE(_xlfn.UNIQUE(_xlfn._xlws.FILTER(ct_01[AC/FCU Brand],ct_01[Zone Application Type]=ZoneTypes!G5,\"\")))","v":"PLEASE SELECT"},"Daikin","Mitsubishi","Toshiba","Sanyo ","Panasonic ","Fujitsu ","Hitachi ","LG","Other"]
[{"$f":"TRANSPOSE(_xlfn.UNIQUE(_xlfn._xlws.FILTER(ct_01[AC/FCU Brand],ct_01[Zone Application Type]=ZoneTypes!G6,\"\")))","v":"PLEASE SELECT"},"Daikin","Mitsubishi","Toshiba","Sanyo ","Panasonic ","Fujitsu ","Hitachi ","LG","Other"]
[{"$f":"TRANSPOSE(_xlfn.UNIQUE(_xlfn._xlws.FILTER(ct_01[AC/FCU Brand],ct_01[Zone Application Type]=ZoneTypes!G7,\"\")))","v":"PLEASE SELECT"},"Daikin","Mitsubishi","Toshiba","Sanyo ","Panasonic ","Fujitsu ","Hitachi ","LG","Other"]
[{"$f":"TRANSPOSE(_xlfn.UNIQUE(_xlfn._xlws.FILTER(ct_01[AC/FCU Brand],ct_01[Zone Application Type]=ZoneTypes!G8,\"\")))","v":"PLEASE SELECT"},"Daikin","Mitsubishi","Toshiba","Sanyo ","Panasonic ","Fujitsu ","Hitachi ","LG","Other"]
[{"$f":"TRANSPOSE(_xlfn.UNIQUE(_xlfn._xlws.FILTER(ct_01[AC/FCU Brand],ct_01[Zone Application Type]=ZoneTypes!G9,\"\")))","v":"N/A"}]
[{"$f":"TRANSPOSE(_xlfn.UNIQUE(_xlfn._xlws.FILTER(ct_01[AC/FCU Brand],ct_01[Zone Application Type]=ZoneTypes!G10,\"\")))","v":"N/A"}]
[{"$f":"TRANSPOSE(_xlfn.UNIQUE(_xlfn._xlws.FILTER(ct_01[AC/FCU Brand],ct_01[Zone Application Type]=ZoneTypes!G11,\"\")))","v":"N/A"}]
[{"$f":"TRANSPOSE(_xlfn.UNIQUE(_xlfn._xlws.FILTER(ct_01[AC/FCU Brand],ct_01[Zone Application Type]=ZoneTypes!G12,\"\")))","v":"N/A"}]
[{"$f":"TRANSPOSE(_xlfn.UNIQUE(_xlfn._xlws.FILTER(ct_01[AC/FCU Brand],ct_01[Zone Application Type]=ZoneTypes!G13,\"\")))","v":"N/A"}]
[{"$f":"TRANSPOSE(_xlfn.UNIQUE(_xlfn._xlws.FILTER(ct_01[AC/FCU Brand],ct_01[Zone Application Type]=ZoneTypes!G14,\"\")))","v":"N/A"}]
[{"$f":"TRANSPOSE(_xlfn.UNIQUE(_xlfn._xlws.FILTER(ct_01[AC/FCU Brand],ct_01[Zone Application Type]=ZoneTypes!G15,\"\")))","v":"N/A"}]
[{"$f":"TRANSPOSE(_xlfn.UNIQUE(_xlfn._xlws.FILTER(ct_01[AC/FCU Brand],ct_01[Zone Application Type]=ZoneTypes!G16,\"\")))","v":"N/A"}]
[{"$f":"TRANSPOSE(_xlfn.UNIQUE(_xlfn._xlws.FILTER(ct_01[AC/FCU Brand],ct_01[Zone Application Type]=ZoneTypes!G17,\"\")))","v":"N/A"}]
[{"$f":"TRANSPOSE(_xlfn.UNIQUE(_xlfn._xlws.FILTER(ct_01[AC/FCU Brand],ct_01[Zone Application Type]=ZoneTypes!G18,\"\")))","v":"N/A"}]
[{"$f":"TRANSPOSE(_xlfn.UNIQUE(_xlfn._xlws.FILTER(ct_01[AC/FCU Brand],ct_01[Zone Application Type]=ZoneTypes!G19,\"\")))","v":"N/A"}]
[{"$f":"TRANSPOSE(_xlfn.UNIQUE(_xlfn._xlws.FILTER(ct_01[AC/FCU Brand],ct_01[Zone Application Type]=ZoneTypes!G20,\"\")))","v":"N/A"}]
[{"$f":"TRANSPOSE(_xlfn.UNIQUE(_xlfn._xlws.FILTER(ct_01[AC/FCU Brand],ct_01[Zone Application Type]=ZoneTypes!G21,\"\")))","v":"N/A"}]
[{"$f":"TRANSPOSE(_xlfn.UNIQUE(_xlfn._xlws.FILTER(ct_01[AC/FCU Brand],ct_01[Zone Application Type]=ZoneTypes!G22,\"\")))","v":"PLEASE SELECT"},"Daikin","Mitsubishi","Toshiba","Sanyo ","Panasonic ","Fujitsu ","Hitachi ","LG","Other"]
[{"$f":"TRANSPOSE(_xlfn.UNIQUE(_xlfn._xlws.FILTER(ct_01[AC/FCU Brand],ct_01[Zone Application Type]=ZoneTypes!G23,\"\")))","v":"PLEASE SELECT"},"Daikin","Mitsubishi","Toshiba","Sanyo ","Panasonic ","Fujitsu ","Hitachi ","LG","Other"]
[{"$f":"TRANSPOSE(_xlfn.UNIQUE(_xlfn._xlws.FILTER(ct_01[AC/FCU Brand],ct_01[Zone Application Type]=ZoneTypes!G24,\"\")))","v":"PLEASE SELECT"},"Daikin","Mitsubishi","Toshiba","Sanyo ","Panasonic ","Fujitsu ","Hitachi ","LG","Other"]
[{"$f":"TRANSPOSE(_xlfn.UNIQUE(_xlfn._xlws.FILTER(ct_01[AC/FCU Brand],ct_01[Zone Application Type]=ZoneTypes!G25,\"\")))","v":"PLEASE SELECT"},"Daikin","Mitsubishi","Toshiba","Sanyo ","Panasonic ","Fujitsu ","Hitachi ","LG","Other"]
[{"$f":"TRANSPOSE(_xlfn.UNIQUE(_xlfn._xlws.FILTER(ct_01[AC/FCU Brand],ct_01[Zone Application Type]=ZoneTypes!G26,\"\")))","v":"PLEASE SELECT"},"Daikin","Mitsubishi","Toshiba","Sanyo ","Panasonic ","Fujitsu ","Hitachi ","LG","Other"]
[{"$f":"TRANSPOSE(_xlfn.UNIQUE(_xlfn._xlws.FILTER(ct_01[AC/FCU Brand],ct_01[Zone Application Type]=ZoneTypes!G27,\"\")))","v":"PLEASE SELECT"},"Daikin","Mitsubishi","Toshiba","Sanyo ","Panasonic ","Fujitsu ","Hitachi ","LG","Other"]
[{"$f":"TRANSPOSE(_xlfn.UNIQUE(_xlfn._xlws.FILTER(ct_01[AC/FCU Brand],ct_01[Zone Application Type]=ZoneTypes!G28,\"\")))","v":"PLEASE SELECT"},"Daikin","Mitsubishi","Toshiba","Sanyo ","Panasonic ","Fujitsu ","Hitachi ","LG","Other"]
[{"$f":"TRANSPOSE(_xlfn.UNIQUE(_xlfn._xlws.FILTER(ct_01[AC/FCU Brand],ct_01[Zone Application Type]=ZoneTypes!G29,\"\")))","v":"PLEASE SELECT"},"Daikin","Mitsubishi","Toshiba","Sanyo ","Panasonic ","Fujitsu ","Hitachi ","LG","Other"]
[{"$f":"TRANSPOSE(_xlfn.UNIQUE(_xlfn._xlws.FILTER(ct_01[AC/FCU Brand],ct_01[Zone Application Type]=ZoneTypes!G30,\"\")))","v":"PLEASE SELECT"},"Daikin","Mitsubishi","Toshiba","Sanyo ","Panasonic ","Fujitsu ","Hitachi ","LG","Other"]
[{"$f":"TRANSPOSE(_xlfn.UNIQUE(_xlfn._xlws.FILTER(ct_01[AC/FCU Brand],ct_01[Zone Application Type]=ZoneTypes!G31,\"\")))","v":"PLEASE SELECT"},"Daikin","Mitsubishi","Toshiba","Sanyo ","Panasonic ","Fujitsu ","Hitachi ","LG","Other"]
[{"$f":"TRANSPOSE(_xlfn.UNIQUE(_xlfn._xlws.FILTER(ct_01[AC/FCU Brand],ct_01[Zone Application Type]=ZoneTypes!G32,\"\")))","v":"PLEASE SELECT"},"Daikin","Mitsubishi","Toshiba","Sanyo ","Panasonic ","Fujitsu ","Hitachi ","LG","Other"]
[{"$f":"TRANSPOSE(_xlfn.UNIQUE(_xlfn._xlws.FILTER(ct_01[AC/FCU Brand],ct_01[Zone Application Type]=ZoneTypes!G33,\"\")))","v":"PLEASE SELECT"},"Daikin","Mitsubishi","Toshiba","Sanyo ","Panasonic ","Fujitsu ","Hitachi ","LG","Other"]
[{"$f":"TRANSPOSE(_xlfn.UNIQUE(_xlfn._xlws.FILTER(ct_01[AC/FCU Brand],ct_01[Zone Application Type]=ZoneTypes!G34,\"\")))","v":""}]
[{"$f":"TRANSPOSE(_xlfn.UNIQUE(_xlfn._xlws.FILTER(ct_01[AC/FCU Brand],ct_01[Zone Application Type]=ZoneTypes!G35,\"\")))","v":"First Select Zone Application Type"}]
[{"$f":"TRANSPOSE(_xlfn.UNIQUE(_xlfn._xlws.FILTER(ct_01[AC/FCU Brand],ct_01[Zone Application Type]=ZoneTypes!G36,\"\")))","v":"First Select Zone Application Type"}]
[{"$f":"TRANSPOSE(_xlfn.UNIQUE(_xlfn._xlws.FILTER(ct_01[AC/FCU Brand],ct_01[Zone Application Type]=ZoneTypes!G37,\"\")))","v":"First Select Zone Application Type"}]
[{"$f":"TRANSPOSE(_xlfn.UNIQUE(_xlfn._xlws.FILTER(ct_01[AC/FCU Brand],ct_01[Zone Application Type]=ZoneTypes!G38,\"\")))","v":"First Select Zone Application Type"}]
[{"$f":"TRANSPOSE(_xlfn.UNIQUE(_xlfn._xlws.FILTER(ct_01[AC/FCU Brand],ct_01[Zone Application Type]=ZoneTypes!G39,\"\")))","v":"First Select Zone Application Type"}]
[{"$f":"TRANSPOSE(_xlfn.UNIQUE(_xlfn._xlws.FILTER(ct_01[AC/FCU Brand],ct_01[Zone Application Type]=ZoneTypes!G40,\"\")))","v":"First Select Zone Application Type"}]
[{"$f":"TRANSPOSE(_xlfn.UNIQUE(_xlfn._xlws.FILTER(ct_01[AC/FCU Brand],ct_01[Zone Application Type]=ZoneTypes!G41,\"\")))","v":"First Select Zone Application Type"}]
[{"$f":"TRANSPOSE(_xlfn.UNIQUE(_xlfn._xlws.FILTER(ct_01[AC/FCU Brand],ct_01[Zone Application Type]=ZoneTypes!G42,\"\")))","v":"First Select Zone Application Type"}]
[{"$f":"TRANSPOSE(_xlfn.UNIQUE(_xlfn._xlws.FILTER(ct_01[AC/FCU Brand],ct_01[Zone Application Type]=ZoneTypes!G43,\"\")))","v":"First Select Zone Application Type"}]
[{"$f":"TRANSPOSE(_xlfn.UNIQUE(_xlfn._xlws.FILTER(ct_01[AC/FCU Brand],ct_01[Zone Application Type]=ZoneTypes!G44,\"\")))","v":"First Select Zone Application Type"}]
[{"$f":"TRANSPOSE(_xlfn.UNIQUE(_xlfn._xlws.FILTER(ct_01[AC/FCU Brand],ct_01[Zone Application Type]=ZoneTypes!G45,\"\")))","v":"First Select Zone Application Type"}]
[{"$f":"TRANSPOSE(_xlfn.UNIQUE(_xlfn._xlws.FILTER(ct_01[AC/FCU Brand],ct_01[Zone Application Type]=ZoneTypes!G46,\"\")))","v":"First Select Zone Application Type"}]
[{"$f":"TRANSPOSE(_xlfn.UNIQUE(_xlfn._xlws.FILTER(ct_01[AC/FCU Brand],ct_01[Zone Application Type]=ZoneTypes!G47,\"\")))","v":"First Select Zone Application Type"}]
[{"$f":"TRANSPOSE(_xlfn.UNIQUE(_xlfn._xlws.FILTER(ct_01[AC/FCU Brand],ct_01[Zone Application Type]=ZoneTypes!G48,\"\")))","v":"First Select Zone Application Type"}]
[{"$f":"TRANSPOSE(_xlfn.UNIQUE(_xlfn._xlws.FILTER(ct_01[AC/FCU Brand],ct_01[Zone Application Type]=ZoneTypes!G49,\"\")))","v":"First Select Zone Application Type"}]
[{"$f":"TRANSPOSE(_xlfn.UNIQUE(_xlfn._xlws.FILTER(ct_01[AC/FCU Brand],ct_01[Zone Application Type]=ZoneTypes!G50,\"\")))","v":"First Select Zone Application Type"}]
[{"$f":"TRANSPOSE(_xlfn.UNIQUE(_xlfn._xlws.FILTER(ct_01[AC/FCU Brand],ct_01[Zone Application Type]=ZoneTypes!G51,\"\")))","v":"First Select Zone Application Type"}]
[{"$f":"TRANSPOSE(_xlfn.UNIQUE(_xlfn._xlws.FILTER(ct_01[AC/FCU Brand],ct_01[Zone Application Type]=ZoneTypes!G52,\"\")))","v":"First Select Zone Application Type"}]
[{"$f":"TRANSPOSE(_xlfn.UNIQUE(_xlfn._xlws.FILTER(ct_01[AC/FCU Brand],ct_01[Zone Application Type]=ZoneTypes!G53,\"\")))","v":"First Select Zone Application Type"}]
[{"$f":"TRANSPOSE(_xlfn.UNIQUE(_xlfn._xlws.FILTER(ct_01[AC/FCU Brand],ct_01[Zone Application Type]=ZoneTypes!G54,\"\")))","v":"First Select Zone Application Type"}]
[{"$f":"TRANSPOSE(_xlfn.UNIQUE(_xlfn._xlws.FILTER(ct_01[AC/FCU Brand],ct_01[Zone Application Type]=ZoneTypes!G55,\"\")))","v":"First Select Zone Application Type"}]
[{"$f":"TRANSPOSE(_xlfn.UNIQUE(_xlfn._xlws.FILTER(ct_01[AC/FCU Brand],ct_01[Zone Application Type]=ZoneTypes!G56,\"\")))","v":"First Select Zone Application Type"}]
[{"$f":"TRANSPOSE(_xlfn.UNIQUE(_xlfn._xlws.FILTER(ct_01[AC/FCU Brand],ct_01[Zone Application Type]=ZoneTypes!G57,\"\")))","v":"First Select Zone Application Type"}]
[{"$f":"TRANSPOSE(_xlfn.UNIQUE(_xlfn._xlws.FILTER(ct_01[AC/FCU Brand],ct_01[Zone Application Type]=ZoneTypes!G58,\"\")))","v":"First Select Zone Application Type"}]
[{"$f":"TRANSPOSE(_xlfn.UNIQUE(_xlfn._xlws.FILTER(ct_01[AC/FCU Brand],ct_01[Zone Application Type]=ZoneTypes!G59,\"\")))","v":"First Select Zone Application Type"}]
[{"$f":"TRANSPOSE(_xlfn.UNIQUE(_xlfn._xlws.FILTER(ct_01[AC/FCU Brand],ct_01[Zone Application Type]=ZoneTypes!G60,\"\")))","v":"First Select Zone Application Type"}]
[{"$f":"TRANSPOSE(_xlfn.UNIQUE(_xlfn._xlws.FILTER(ct_01[AC/FCU Brand],ct_01[Zone Application Type]=ZoneTypes!G61,\"\")))","v":"First Select Zone Application Type"}]
[{"$f":"TRANSPOSE(_xlfn.UNIQUE(_xlfn._xlws.FILTER(ct_01[AC/FCU Brand],ct_01[Zone Application Type]=ZoneTypes!G62,\"\")))","v":"First Select Zone Application Type"}]
[{"$f":"TRANSPOSE(_xlfn.UNIQUE(_xlfn._xlws.FILTER(ct_01[AC/FCU Brand],ct_01[Zone Application Type]=ZoneTypes!G63,\"\")))","v":"First Select Zone Application Type"}]
[{"$f":"TRANSPOSE(_xlfn.UNIQUE(_xlfn._xlws.FILTER(ct_01[AC/FCU Brand],ct_01[Zone Application Type]=ZoneTypes!G64,\"\")))","v":"First Select Zone Application Type"}]
[{"$f":"TRANSPOSE(_xlfn.UNIQUE(_xlfn._xlws.FILTER(ct_01[AC/FCU Brand],ct_01[Zone Application Type]=ZoneTypes!G65,\"\")))","v":"First Select Zone Application Type"}]
[{"$f":"TRANSPOSE(_xlfn.UNIQUE(_xlfn._xlws.FILTER(ct_01[AC/FCU Brand],ct_01[Zone Application Type]=ZoneTypes!G66,\"\")))","v":"First Select Zone Application Type"}]
[{"$f":"TRANSPOSE(_xlfn.UNIQUE(_xlfn._xlws.FILTER(ct_01[AC/FCU Brand],ct_01[Zone Application Type]=ZoneTypes!G67,\"\")))","v":"First Select Zone Application Type"}]
[{"$f":"TRANSPOSE(_xlfn.UNIQUE(_xlfn._xlws.FILTER(ct_01[AC/FCU Brand],ct_01[Zone Application Type]=ZoneTypes!G68,\"\")))","v":"First Select Zone Application Type"}]
[{"$f":"TRANSPOSE(_xlfn.UNIQUE(_xlfn._xlws.FILTER(ct_01[AC/FCU Brand],ct_01[Zone Application Type]=ZoneTypes!G69,\"\")))","v":"First Select Zone Application Type"}]
[{"$f":"TRANSPOSE(_xlfn.UNIQUE(_xlfn._xlws.FILTER(ct_01[AC/FCU Brand],ct_01[Zone Application Type]=ZoneTypes!G70,\"\")))","v":"First Select Zone Application Type"}]
[{"$f":"TRANSPOSE(_xlfn.UNIQUE(_xlfn._xlws.FILTER(ct_01[AC/FCU Brand],ct_01[Zone Application Type]=ZoneTypes!G71,\"\")))","v":"First Select Zone Application Type"}]
[{"$f":"TRANSPOSE(_xlfn.UNIQUE(_xlfn._xlws.FILTER(ct_01[AC/FCU Brand],ct_01[Zone Application Type]=ZoneTypes!G72,\"\")))","v":"First Select Zone Application Type"}]
[{"$f":"TRANSPOSE(_xlfn.UNIQUE(_xlfn._xlws.FILTER(ct_01[AC/FCU Brand],ct_01[Zone Application Type]=ZoneTypes!G73,\"\")))","v":"First Select Zone Application Type"}]
[{"$f":"TRANSPOSE(_xlfn.UNIQUE(_xlfn._xlws.FILTER(ct_01[AC/FCU Brand],ct_01[Zone Application Type]=ZoneTypes!G74,\"\")))","v":"First Select Zone Application Type"}]
[{"$f":"TRANSPOSE(_xlfn.UNIQUE(_xlfn._xlws.FILTER(ct_01[AC/FCU Brand],ct_01[Zone Application Type]=ZoneTypes!G75,\"\")))","v":"First Select Zone Application Type"}]
[{"$f":"TRANSPOSE(_xlfn.UNIQUE(_xlfn._xlws.FILTER(ct_01[AC/FCU Brand],ct_01[Zone Application Type]=ZoneTypes!G76,\"\")))","v":"First Select Zone Application Type"}]
[{"$f":"TRANSPOSE(_xlfn.UNIQUE(_xlfn._xlws.FILTER(ct_01[AC/FCU Brand],ct_01[Zone Application Type]=ZoneTypes!G77,\"\")))","v":"First Select Zone Application Type"}]
[{"$f":"TRANSPOSE(_xlfn.UNIQUE(_xlfn._xlws.FILTER(ct_01[AC/FCU Brand],ct_01[Zone Application Type]=ZoneTypes!G78,\"\")))","v":"First Select Zone Application Type"}]
[{"$f":"TRANSPOSE(_xlfn.UNIQUE(_xlfn._xlws.FILTER(ct_01[AC/FCU Brand],ct_01[Zone Application Type]=ZoneTypes!G79,\"\")))","v":"First Select Zone Application Type"}]
[{"$f":"TRANSPOSE(_xlfn.UNIQUE(_xlfn._xlws.FILTER(ct_01[AC/FCU Brand],ct_01[Zone Application Type]=ZoneTypes!G80,\"\")))","v":"First Select Zone Application Type"}]
[{"$f":"TRANSPOSE(_xlfn.UNIQUE(_xlfn._xlws.FILTER(ct_01[AC/FCU Brand],ct_01[Zone Application Type]=ZoneTypes!G81,\"\")))","v":"First Select Zone Application Type"}]
[{"$f":"TRANSPOSE(_xlfn.UNIQUE(_xlfn._xlws.FILTER(ct_01[AC/FCU Brand],ct_01[Zone Application Type]=ZoneTypes!G82,\"\")))","v":"First Select Zone Application Type"}]
[{"$f":"TRANSPOSE(_xlfn.UNIQUE(_xlfn._xlws.FILTER(ct_01[AC/FCU Brand],ct_01[Zone Application Type]=ZoneTypes!G83,\"\")))","v":"First Select Zone Application Type"}]
[{"$f":"TRANSPOSE(_xlfn.UNIQUE(_xlfn._xlws.FILTER(ct_01[AC/FCU Brand],ct_01[Zone Application Type]=ZoneTypes!G84,\"\")))","v":"First Select Zone Application Type"}]
[{"$f":"TRANSPOSE(_xlfn.UNIQUE(_xlfn._xlws.FILTER(ct_01[AC/FCU Brand],ct_01[Zone Application Type]=ZoneTypes!G85,\"\")))","v":"First Select Zone Application Type"}]
[{"$f":"TRANSPOSE(_xlfn.UNIQUE(_xlfn._xlws.FILTER(ct_01[AC/FCU Brand],ct_01[Zone Application Type]=ZoneTypes!G86,\"\")))","v":"First Select Zone Application Type"}]
[{"$f":"TRANSPOSE(_xlfn.UNIQUE(_xlfn._xlws.FILTER(ct_01[AC/FCU Brand],ct_01[Zone Application Type]=ZoneTypes!G87,\"\")))","v":"First Select Zone Application Type"}]
[{"$f":"TRANSPOSE(_xlfn.UNIQUE(_xlfn._xlws.FILTER(ct_01[AC/FCU Brand],ct_01[Zone Application Type]=ZoneTypes!G88,\"\")))","v":"First Select Zone Application Type"}]
[{"$f":"TRANSPOSE(_xlfn.UNIQUE(_xlfn._xlws.FILTER(ct_01[AC/FCU Brand],ct_01[Zone Application Type]=ZoneTypes!G89,\"\")))","v":"First Select Zone Application Type"}]
[{"$f":"TRANSPOSE(_xlfn.UNIQUE(_xlfn._xlws.FILTER(ct_01[AC/FCU Brand],ct_01[Zone Application Type]=ZoneTypes!G90,\"\")))","v":"First Select Zone Application Type"}]
[{"$f":"TRANSPOSE(_xlfn.UNIQUE(_xlfn._xlws.FILTER(ct_01[AC/FCU Brand],ct_01[Zone Application Type]=ZoneTypes!G91,\"\")))","v":"First Select Zone Application Type"}]
[{"$f":"TRANSPOSE(_xlfn.UNIQUE(_xlfn._xlws.FILTER(ct_01[AC/FCU Brand],ct_01[Zone Application Type]=ZoneTypes!G92,\"\")))","v":"First Select Zone Application Type"}]
[{"$f":"TRANSPOSE(_xlfn.UNIQUE(_xlfn._xlws.FILTER(ct_01[AC/FCU Brand],ct_01[Zone Application Type]=ZoneTypes!G93,\"\")))","v":"First Select Zone Application Type"}]
[{"$f":"TRANSPOSE(_xlfn.UNIQUE(_xlfn._xlws.FILTER(ct_01[AC/FCU Brand],ct_01[Zone Application Type]=ZoneTypes!G94,\"\")))","v":"First Select Zone Application Type"}]
[{"$f":"TRANSPOSE(_xlfn.UNIQUE(_xlfn._xlws.FILTER(ct_01[AC/FCU Brand],ct_01[Zone Application Type]=ZoneTypes!G95,\"\")))","v":"First Select Zone Application Type"}]
[{"$f":"TRANSPOSE(_xlfn.UNIQUE(_xlfn._xlws.FILTER(ct_01[AC/FCU Brand],ct_01[Zone Application Type]=ZoneTypes!G96,\"\")))","v":"First Select Zone Application Type"}]
[{"$f":"TRANSPOSE(_xlfn.UNIQUE(_xlfn._xlws.FILTER(ct_01[AC/FCU Brand],ct_01[Zone Application Type]=ZoneTypes!G97,\"\")))","v":"First Select Zone Application Type"}]
[{"$f":"TRANSPOSE(_xlfn.UNIQUE(_xlfn._xlws.FILTER(ct_01[AC/FCU Brand],ct_01[Zone Application Type]=ZoneTypes!G98,\"\")))","v":"First Select Zone Application Type"}]
[{"$f":"TRANSPOSE(_xlfn.UNIQUE(_xlfn._xlws.FILTER(ct_01[AC/FCU Brand],ct_01[Zone Application Type]=ZoneTypes!G99,\"\")))","v":"First Select Zone Application Type"}]
[{"$f":"TRANSPOSE(_xlfn.UNIQUE(_xlfn._xlws.FILTER(ct_01[AC/FCU Brand],ct_01[Zone Application Type]=ZoneTypes!G100,\"\")))","v":"First Select Zone Application Type"}]
[{"$f":"TRANSPOSE(_xlfn.UNIQUE(_xlfn._xlws.FILTER(ct_01[AC/FCU Brand],ct_01[Zone Application Type]=ZoneTypes!G101,\"\")))","v":"First Select Zone Application Type"}]
[{"$f":"TRANSPOSE(_xlfn.UNIQUE(_xlfn._xlws.FILTER(ct_01[AC/FCU Brand],ct_01[Zone Application Type]=ZoneTypes!G102,\"\")))","v":"First Select Zone Application Type"}]
[{"$f":"TRANSPOSE(_xlfn.UNIQUE(_xlfn._xlws.FILTER(ct_01[AC/FCU Brand],ct_01[Zone Application Type]=ZoneTypes!G103,\"\")))","v":"First Select Zone Application Type"}]
[{"$f":"TRANSPOSE(_xlfn.UNIQUE(_xlfn._xlws.FILTER(ct_01[AC/FCU Brand],ct_01[Zone Application Type]=ZoneTypes!G104,\"\")))","v":"First Select Zone Application Type"}]
[{"$f":"TRANSPOSE(_xlfn.UNIQUE(_xlfn._xlws.FILTER(ct_01[AC/FCU Brand],ct_01[Zone Application Type]=ZoneTypes!G105,\"\")))","v":"First Select Zone Application Type"}]
[{"$f":"TRANSPOSE(_xlfn.UNIQUE(_xlfn._xlws.FILTER(ct_01[AC/FCU Brand],ct_01[Zone Application Type]=ZoneTypes!G106,\"\")))","v":"First Select Zone Application Type"}]
[{"$f":"TRANSPOSE(_xlfn.UNIQUE(_xlfn._xlws.FILTER(ct_01[AC/FCU Brand],ct_01[Zone Application Type]=ZoneTypes!G107,\"\")))","v":"First Select Zone Application Type"}]
[{"$f":"TRANSPOSE(_xlfn.UNIQUE(_xlfn._xlws.FILTER(ct_01[AC/FCU Brand],ct_01[Zone Application Type]=ZoneTypes!G108,\"\")))","v":"First Select Zone Application Type"}]
[{"$f":"TRANSPOSE(_xlfn.UNIQUE(_xlfn._xlws.FILTER(ct_01[AC/FCU Brand],ct_01[Zone Application Type]=ZoneTypes!G109,\"\")))","v":"First Select Zone Application Type"}]
[{"$f":"TRANSPOSE(_xlfn.UNIQUE(_xlfn._xlws.FILTER(ct_01[AC/FCU Brand],ct_01[Zone Application Type]=ZoneTypes!G110,\"\")))","v":"First Select Zone Application Type"}]
[{"$f":"TRANSPOSE(_xlfn.UNIQUE(_xlfn._xlws.FILTER(ct_01[AC/FCU Brand],ct_01[Zone Application Type]=ZoneTypes!G111,\"\")))","v":"First Select Zone Application Type"}]
[{"$f":"TRANSPOSE(_xlfn.UNIQUE(_xlfn._xlws.FILTER(ct_01[AC/FCU Brand],ct_01[Zone Application Type]=ZoneTypes!G112,\"\")))","v":"First Select Zone Application Type"}]
[{"$f":"TRANSPOSE(_xlfn.UNIQUE(_xlfn._xlws.FILTER(ct_01[AC/FCU Brand],ct_01[Zone Application Type]=ZoneTypes!G113,\"\")))","v":"First Select Zone Application Type"}]
[{"$f":"TRANSPOSE(_xlfn.UNIQUE(_xlfn._xlws.FILTER(ct_01[AC/FCU Brand],ct_01[Zone Application Type]=ZoneTypes!G114,\"\")))","v":"First Select Zone Application Type"}]
[{"$f":"TRANSPOSE(_xlfn.UNIQUE(_xlfn._xlws.FILTER(ct_01[AC/FCU Brand],ct_01[Zone Application Type]=ZoneTypes!G115,\"\")))","v":"First Select Zone Application Type"}]
[{"$f":"TRANSPOSE(_xlfn.UNIQUE(_xlfn._xlws.FILTER(ct_01[AC/FCU Brand],ct_01[Zone Application Type]=ZoneTypes!G116,\"\")))","v":"First Select Zone Application Type"}]
[{"$f":"TRANSPOSE(_xlfn.UNIQUE(_xlfn._xlws.FILTER(ct_01[AC/FCU Brand],ct_01[Zone Application Type]=ZoneTypes!G117,\"\")))","v":"First Select Zone Application Type"}]
[{"$f":"TRANSPOSE(_xlfn.UNIQUE(_xlfn._xlws.FILTER(ct_01[AC/FCU Brand],ct_01[Zone Application Type]=ZoneTypes!G118,\"\")))","v":"First Select Zone Application Type"}]
[{"$f":"TRANSPOSE(_xlfn.UNIQUE(_xlfn._xlws.FILTER(ct_01[AC/FCU Brand],ct_01[Zone Application Type]=ZoneTypes!G119,\"\")))","v":"First Select Zone Application Type"}]
[{"$f":"TRANSPOSE(_xlfn.UNIQUE(_xlfn._xlws.FILTER(ct_01[AC/FCU Brand],ct_01[Zone Application Type]=ZoneTypes!G120,\"\")))","v":"First Select Zone Application Type"}]
[{"$f":"TRANSPOSE(_xlfn.UNIQUE(_xlfn._xlws.FILTER(ct_01[AC/FCU Brand],ct_01[Zone Application Type]=ZoneTypes!G121,\"\")))","v":"First Select Zone Application Type"}]
[{"$f":"TRANSPOSE(_xlfn.UNIQUE(_xlfn._xlws.FILTER(ct_01[AC/FCU Brand],ct_01[Zone Application Type]=ZoneTypes!G122,\"\")))","v":"First Select Zone Application Type"}]
[{"$f":"TRANSPOSE(_xlfn.UNIQUE(_xlfn._xlws.FILTER(ct_01[AC/FCU Brand],ct_01[Zone Application Type]=ZoneTypes!G123,\"\")))","v":"First Select Zone Application Type"}]
[{"$f":"TRANSPOSE(_xlfn.UNIQUE(_xlfn._xlws.FILTER(ct_01[AC/FCU Brand],ct_01[Zone Application Type]=ZoneTypes!G124,\"\")))","v":"First Select Zone Application Type"}]
[{"$f":"TRANSPOSE(_xlfn.UNIQUE(_xlfn._xlws.FILTER(ct_01[AC/FCU Brand],ct_01[Zone Application Type]=ZoneTypes!G125,\"\")))","v":"First Select Zone Application Type"}]
[{"$f":"TRANSPOSE(_xlfn.UNIQUE(_xlfn._xlws.FILTER(ct_01[AC/FCU Brand],ct_01[Zone Application Type]=ZoneTypes!G126,\"\")))","v":"First Select Zone Application Type"}]
[{"$f":"TRANSPOSE(_xlfn.UNIQUE(_xlfn._xlws.FILTER(ct_01[AC/FCU Brand],ct_01[Zone Application Type]=ZoneTypes!G127,\"\")))","v":"First Select Zone Application Type"}]
[{"$f":"TRANSPOSE(_xlfn.UNIQUE(_xlfn._xlws.FILTER(ct_01[AC/FCU Brand],ct_01[Zone Application Type]=ZoneTypes!G128,\"\")))","v":"First Select Zone Application Type"}]
[{"$f":"TRANSPOSE(_xlfn.UNIQUE(_xlfn._xlws.FILTER(ct_01[AC/FCU Brand],ct_01[Zone Application Type]=ZoneTypes!G129,\"\")))","v":"First Select Zone Application Type"}]
[{"$f":"TRANSPOSE(_xlfn.UNIQUE(_xlfn._xlws.FILTER(ct_01[AC/FCU Brand],ct_01[Zone Application Type]=ZoneTypes!G130,\"\")))","v":"First Select Zone Application Type"}]
[{"$f":"TRANSPOSE(_xlfn.UNIQUE(_xlfn._xlws.FILTER(ct_01[AC/FCU Brand],ct_01[Zone Application Type]=ZoneTypes!G131,\"\")))","v":"First Select Zone Application Type"}]
[{"$f":"TRANSPOSE(_xlfn.UNIQUE(_xlfn._xlws.FILTER(ct_01[AC/FCU Brand],ct_01[Zone Application Type]=ZoneTypes!G132,\"\")))","v":"First Select Zone Application Type"}]
[{"$f":"TRANSPOSE(_xlfn.UNIQUE(_xlfn._xlws.FILTER(ct_01[AC/FCU Brand],ct_01[Zone Application Type]=ZoneTypes!G133,\"\")))","v":"First Select Zone Application Type"}]
[{"$f":"TRANSPOSE(_xlfn.UNIQUE(_xlfn._xlws.FILTER(ct_01[AC/FCU Brand],ct_01[Zone Application Type]=ZoneTypes!G134,\"\")))","v":"First Select Zone Application Type"}]
[{"$f":"TRANSPOSE(_xlfn.UNIQUE(_xlfn._xlws.FILTER(ct_01[AC/FCU Brand],ct_01[Zone Application Type]=ZoneTypes!G135,\"\")))","v":"First Select Zone Application Type"}]
[{"$f":"TRANSPOSE(_xlfn.UNIQUE(_xlfn._xlws.FILTER(ct_01[AC/FCU Brand],ct_01[Zone Application Type]=ZoneTypes!G136,\"\")))","v":"First Select Zone Application Type"}]
[{"$f":"TRANSPOSE(_xlfn.UNIQUE(_xlfn._xlws.FILTER(ct_01[AC/FCU Brand],ct_01[Zone Application Type]=ZoneTypes!G137,\"\")))","v":"First Select Zone Application Type"}]
[{"$f":"TRANSPOSE(_xlfn.UNIQUE(_xlfn._xlws.FILTER(ct_01[AC/FCU Brand],ct_01[Zone Application Type]=ZoneTypes!G138,\"\")))","v":"First Select Zone Application Type"}]
[{"$f":"TRANSPOSE(_xlfn.UNIQUE(_xlfn._xlws.FILTER(ct_01[AC/FCU Brand],ct_01[Zone Application Type]=ZoneTypes!G139,\"\")))","v":"First Select Zone Application Type"}]
[{"$f":"TRANSPOSE(_xlfn.UNIQUE(_xlfn._xlws.FILTER(ct_01[AC/FCU Brand],ct_01[Zone Application Type]=ZoneTypes!G140,\"\")))","v":"First Select Zone Application Type"}]
[{"$f":"TRANSPOSE(_xlfn.UNIQUE(_xlfn._xlws.FILTER(ct_01[AC/FCU Brand],ct_01[Zone Application Type]=ZoneTypes!G141,\"\")))","v":"First Select Zone Application Type"}]
[{"$f":"TRANSPOSE(_xlfn.UNIQUE(_xlfn._xlws.FILTER(ct_01[AC/FCU Brand],ct_01[Zone Application Type]=ZoneTypes!G142,\"\")))","v":"First Select Zone Application Type"}]
[{"$f":"TRANSPOSE(_xlfn.UNIQUE(_xlfn._xlws.FILTER(ct_01[AC/FCU Brand],ct_01[Zone Application Type]=ZoneTypes!G143,\"\")))","v":"First Select Zone Application Type"}]
[{"$f":"TRANSPOSE(_xlfn.UNIQUE(_xlfn._xlws.FILTER(ct_01[AC/FCU Brand],ct_01[Zone Application Type]=ZoneTypes!G144,\"\")))","v":"First Select Zone Application Type"}]
[{"$f":"TRANSPOSE(_xlfn.UNIQUE(_xlfn._xlws.FILTER(ct_01[AC/FCU Brand],ct_01[Zone Application Type]=ZoneTypes!G145,\"\")))","v":"First Select Zone Application Type"}]
[{"$f":"TRANSPOSE(_xlfn.UNIQUE(_xlfn._xlws.FILTER(ct_01[AC/FCU Brand],ct_01[Zone Application Type]=ZoneTypes!G146,\"\")))","v":"First Select Zone Application Type"}]
[{"$f":"TRANSPOSE(_xlfn.UNIQUE(_xlfn._xlws.FILTER(ct_01[AC/FCU Brand],ct_01[Zone Application Type]=ZoneTypes!G147,\"\")))","v":"First Select Zone Application Type"}]
[{"$f":"TRANSPOSE(_xlfn.UNIQUE(_xlfn._xlws.FILTER(ct_01[AC/FCU Brand],ct_01[Zone Application Type]=ZoneTypes!G148,\"\")))","v":"First Select Zone Application Type"}]
[{"$f":"TRANSPOSE(_xlfn.UNIQUE(_xlfn._xlws.FILTER(ct_01[AC/FCU Brand],ct_01[Zone Application Type]=ZoneTypes!G149,\"\")))","v":"First Select Zone Application Type"}]
[{"$f":"TRANSPOSE(_xlfn.UNIQUE(_xlfn._xlws.FILTER(ct_01[AC/FCU Brand],ct_01[Zone Application Type]=ZoneTypes!G150,\"\")))","v":"First Select Zone Application Type"}]
[{"$f":"TRANSPOSE(_xlfn.UNIQUE(_xlfn._xlws.FILTER(ct_01[AC/FCU Brand],ct_01[Zone Application Type]=ZoneTypes!G151,\"\")))","v":"First Select Zone Application Type"}]
[{"$f":"TRANSPOSE(_xlfn.UNIQUE(_xlfn._xlws.FILTER(ct_01[AC/FCU Brand],ct_01[Zone Application Type]=ZoneTypes!G152,\"\")))","v":"First Select Zone Application Type"}]
[{"$f":"TRANSPOSE(_xlfn.UNIQUE(_xlfn._xlws.FILTER(ct_01[AC/FCU Brand],ct_01[Zone Application Type]=ZoneTypes!G153,\"\")))","v":"First Select Zone Application Type"}]
[{"$f":"TRANSPOSE(_xlfn.UNIQUE(_xlfn._xlws.FILTER(ct_01[AC/FCU Brand],ct_01[Zone Application Type]=ZoneTypes!G154,\"\")))","v":"First Select Zone Application Type"}]
[{"$f":"TRANSPOSE(_xlfn.UNIQUE(_xlfn._xlws.FILTER(ct_01[AC/FCU Brand],ct_01[Zone Application Type]=ZoneTypes!G155,\"\")))","v":"First Select Zone Application Type"}]
[{"$f":"TRANSPOSE(_xlfn.UNIQUE(_xlfn._xlws.FILTER(ct_01[AC/FCU Brand],ct_01[Zone Application Type]=ZoneTypes!G156,\"\")))","v":"First Select Zone Application Type"}]
[{"$error":"#REF!"}]
[{"$error":"#REF!"}]
[{"$error":"#REF!"}]
[{"$error":"#REF!"}]
[{"$error":"#REF!"}]
[{"$error":"#REF!"}]
[{"$error":"#REF!"}]
[{"$error":"#REF!"}]
[{"$error":"#REF!"}]
[{"$error":"#REF!"}]
[{"$error":"#REF!"}]
[{"$error":"#REF!"}]
[{"$error":"#REF!"}]
[{"$error":"#REF!"}]
[{"$error":"#REF!"}]
[{"$error":"#REF!"}]
[{"$error":"#REF!"}]
[{"$error":"#REF!"}]
[{"$error":"#REF!"}]
[{"$error":"#REF!"}]
[{"$error":"#REF!"}]
[{"$error":"#REF!"}]
[{"$error":"#REF!"}]
[{"$error":"#REF!"}]
[{"$error":"#REF!"}]
[{"$error":"#REF!"}]
[{"$error":"#REF!"}]
[{"$error":"#REF!"}]
[{"$error":"#REF!"}]
[{"$error":"#REF!"}]
[{"$error":"#REF!"}]
[{"$error":"#REF!"}]
[{"$error":"#REF!"}]
[{"$error":"#REF!"}]
[{"$error":"#REF!"}]
[{"$error":"#REF!"}]
[{"$error":"#REF!"}]
[{"$error":"#REF!"}]
[{"$error":"#REF!"}]
[{"$error":"#REF!"}]
[{"$error":"#REF!"}]
[{"$error":"#REF!"}]
[{"$error":"#REF!"}]
[{"$error":"#REF!"}]
[{"$error":"#REF!"}]
[{"$error":"#REF!"}]
[{"$error":"#REF!"}]
[{"$error":"#REF!"}]
[{"$error":"#REF!"}]
[{"$error":"#REF!"}]
[{"$error":"#REF!"}]
[{"$error":"#REF!"}]
[{"$error":"#REF!"}]
[{"$error":"#REF!"}]
[{"$error":"#REF!"}]
[{"$error":"#REF!"}]
[{"$error":"#REF!"}]
[{"$error":"#REF!"}]
[{"$error":"#REF!"}]
[{"$error":"#REF!"}]
[{"$error":"#REF!"}]
[{"$error":"#REF!"}]
[{"$error":"#REF!"}]
[{"$error":"#REF!"}]
[{"$error":"#REF!"}]
[{"$error":"#REF!"}]
[{"$error":"#REF!"}]
[{"$error":"#REF!"}]
[{"$error":"#REF!"}]
[{"$error":"#REF!"}]
[{"$error":"#REF!"}]
[{"$error":"#REF!"}]
[{"$error":"#REF!"}]
[{"$error":"#REF!"}]
[{"$error":"#REF!"}]
[{"$error":"#REF!"}]
[{"$error":"#REF!"}]
[{"$error":"#REF!"}]
[{"$error":"#REF!"}]
[{"$error":"#REF!"}]
[{"$error":"#REF!"}]
[{"$error":"#REF!"}]
[{"$error":"#REF!"}]
[{"$error":"#REF!"}]
[{"$error":"#REF!"}]
[{"$error":"#REF!"}]
[{"$error":"#REF!"}]
[{"$error":"#REF!"}]
[{"$error":"#REF!"}]
[{"$error":"#REF!"}]
[{"$error":"#REF!"}]
[{"$error":"#REF!"}]
[{"$error":"#REF!"}]
[{"$error":"#REF!"}]
[{"$error":"#REF!"}]
[{"$error":"#REF!"}]
[{"$error":"#REF!"}]
[{"$error":"#REF!"}]
[{"$error":"#REF!"}]
[{"$error":"#REF!"}]
[{"$error":"#REF!"}]
[{"$error":"#REF!"}]
[{"$error":"#REF!"}]
[{"$error":"#REF!"}]
[{"$error":"#REF!"}]
[{"$error":"#REF!"}]
[{"$error":"#REF!"}]
[{"$error":"#REF!"}]
[{"$error":"#REF!"}]
[{"$error":"#REF!"}]
[{"$error":"#REF!"}]
[{"$error":"#REF!"}]
[{"$error":"#REF!"}]
[{"$error":"#REF!"}]
[{"$error":"#REF!"}]
[{"$error":"#REF!"}]
[{"$error":"#REF!"}]
[{"$error":"#REF!"}]
[{"$error":"#REF!"}]
[{"$error":"#REF!"}]
[{"$error":"#REF!"}]
[{"$error":"#REF!"}]
[{"$error":"#REF!"}]
[{"$error":"#REF!"}]
[{"$error":"#REF!"}]
[{"$error":"#REF!"}]
[{"$error":"#REF!"}]
[{"$error":"#REF!"}]
[{"$error":"#REF!"}]
[{"$error":"#REF!"}]
[{"$error":"#REF!"}]
[{"$error":"#REF!"}]
[{"$error":"#REF!"}]
[{"$error":"#REF!"}]
[{"$error":"#REF!"}]
[{"$error":"#REF!"}]
[{"$error":"#REF!"}]
[{"$error":"#REF!"}]
[{"$error":"#REF!"}]
[{"$error":"#REF!"}]
[{"$error":"#REF!"}]
[{"$error":"#REF!"}]
[{"$error":"#REF!"}]
[{"$error":"#REF!"}]
[{"$error":"#REF!"}]
[{"$error":"#REF!"}]
[{"$error":"#REF!"}]
[{"$error":"#REF!"}]
[{"$error":"#REF!"}]
[{"$error":"#REF!"}]
[{"$error":"#REF!"}]
[{"$error":"#REF!"}]
[{"$error":"#REF!"}]

{"sheet":"SpillFTL","index":5,"n_rows":309,"n_cols":18,"rows_kept":309,"hidden":true}
["Dependant Dropdown Spill List"]
["Horizontal Spill for Floor Temperature Limits °C"]
[{"$f":"TRANSPOSE(_xlfn.UNIQUE(_xlfn._xlws.FILTER(ct_01[Floor Temperature Limit °C],ct_01[Zone Application Type]=ZoneTypes!G3,\"\")))","v":"N/A"}]
[{"$f":"TRANSPOSE(_xlfn.UNIQUE(_xlfn._xlws.FILTER(ct_01[Floor Temperature Limit °C],ct_01[Zone Application Type]=ZoneTypes!G4,\"\")))","v":"PLEASE SELECT"},"TBA","25 °C","26 °C","27 °C","28 °C","29 °C","30 °C","31 °C","32 °C","33 °C","34 °C","35 °C","36 °C","37 °C","38 °C","39 °C","40 °C"]
[{"$f":"TRANSPOSE(_xlfn.UNIQUE(_xlfn._xlws.FILTER(ct_01[Floor Temperature Limit °C],ct_01[Zone Application Type]=ZoneTypes!G5,\"\")))","v":"N/A"}]
[{"$f":"TRANSPOSE(_xlfn.UNIQUE(_xlfn._xlws.FILTER(ct_01[Floor Temperature Limit °C],ct_01[Zone Application Type]=ZoneTypes!G6,\"\")))","v":"PLEASE SELECT"},"TBA","25 °C","26 °C","27 °C","28 °C","29 °C","30 °C","31 °C","32 °C","33 °C","34 °C","35 °C","36 °C","37 °C","38 °C","39 °C","40 °C"]
[{"$f":"TRANSPOSE(_xlfn.UNIQUE(_xlfn._xlws.FILTER(ct_01[Floor Temperature Limit °C],ct_01[Zone Application Type]=ZoneTypes!G7,\"\")))","v":"N/A"}]
[{"$f":"TRANSPOSE(_xlfn.UNIQUE(_xlfn._xlws.FILTER(ct_01[Floor Temperature Limit °C],ct_01[Zone Application Type]=ZoneTypes!G8,\"\")))","v":"N/A"}]
[{"$f":"TRANSPOSE(_xlfn.UNIQUE(_xlfn._xlws.FILTER(ct_01[Floor Temperature Limit °C],ct_01[Zone Application Type]=ZoneTypes!G9,\"\")))","v":"N/A"}]
[{"$f":"TRANSPOSE(_xlfn.UNIQUE(_xlfn._xlws.FILTER(ct_01[Floor Temperature Limit °C],ct_01[Zone Application Type]=ZoneTypes!G10,\"\")))","v":"PLEASE SELECT"},"TBA","25 °C","26 °C","27 °C","28 °C","29 °C","30 °C","31 °C","32 °C","33 °C","34 °C","35 °C","36 °C","37 °C","38 °C","39 °C","40 °C"]
[{"$f":"TRANSPOSE(_xlfn.UNIQUE(_xlfn._xlws.FILTER(ct_01[Floor Temperature Limit °C],ct_01[Zone Application Type]=ZoneTypes!G11,\"\")))","v":"N/A"}]
[{"$f":"TRANSPOSE(_xlfn.UNIQUE(_xlfn._xlws.FILTER(ct_01[Floor Temperature Limit °C],ct_01[Zone Application Type]=ZoneTypes!G12,\"\")))","v":"N/A"}]
[{"$f":"TRANSPOSE(_xlfn.UNIQUE(_xlfn._xlws.FILTER(ct_01[Floor Temperature Limit °C],ct_01[Zone Application Type]=ZoneTypes!G13,\"\")))","v":"PLEASE SELECT"},"TBA","25 °C","26 °C","27 °C","28 °C","29 °C","30 °C","31 °C","32 °C","33 °C","34 °C","35 °C","36 °C","37 °C","38 °C","39 °C","40 °C"]
[{"$f":"TRANSPOSE(_xlfn.UNIQUE(_xlfn._xlws.FILTER(ct_01[Floor Temperature Limit °C],ct_01[Zone Application Type]=ZoneTypes!G14,\"\")))","v":"N/A"}]
[{"$f":"TRANSPOSE(_xlfn.UNIQUE(_xlfn._xlws.FILTER(ct_01[Floor Temperature Limit °C],ct_01[Zone Application Type]=ZoneTypes!G15,\"\")))","v":"N/A"}]
[{"$f":"TRANSPOSE(_xlfn.UNIQUE(_xlfn._xlws.FILTER(ct_01[Floor Temperature Limit °C],ct_01[Zone Application Type]=ZoneTypes!G16,\"\")))","v":"N/A"}]
[{"$f":"TRANSPOSE(_xlfn.UNIQUE(_xlfn._xlws.FILTER(ct_01[Floor Temperature Limit °C],ct_01[Zone Application Type]=ZoneTypes!G17,\"\")))","v":"N/A"}]
[{"$f":"TRANSPOSE(_xlfn.UNIQUE(_xlfn._xlws.FILTER(ct_01[Floor Temperature Limit °C],ct_01[Zone Application Type]=ZoneTypes!G18,\"\")))","v":"N/A"}]
[{"$f":"TRANSPOSE(_xlfn.UNIQUE(_xlfn._xlws.FILTER(ct_01[Floor Temperature Limit °C],ct_01[Zone Application Type]=ZoneTypes!G19,\"\")))","v":"N/A"}]
[{"$f":"TRANSPOSE(_xlfn.UNIQUE(_xlfn._xlws.FILTER(ct_01[Floor Temperature Limit °C],ct_01[Zone Application Type]=ZoneTypes!G20,\"\")))","v":"N/A"}]
[{"$f":"TRANSPOSE(_xlfn.UNIQUE(_xlfn._xlws.FILTER(ct_01[Floor Temperature Limit °C],ct_01[Zone Application Type]=ZoneTypes!G21,\"\")))","v":"N/A"}]
[{"$f":"TRANSPOSE(_xlfn.UNIQUE(_xlfn._xlws.FILTER(ct_01[Floor Temperature Limit °C],ct_01[Zone Application Type]=ZoneTypes!G22,\"\")))","v":"N/A"}]
[{"$f":"TRANSPOSE(_xlfn.UNIQUE(_xlfn._xlws.FILTER(ct_01[Floor Temperature Limit °C],ct_01[Zone Application Type]=ZoneTypes!G23,\"\")))","v":"PLEASE SELECT"},"TBA","25 °C","26 °C","27 °C","28 °C","29 °C","30 °C","31 °C","32 °C","33 °C","34 °C","35 °C","36 °C","37 °C","38 °C","39 °C","40 °C"]
[{"$f":"TRANSPOSE(_xlfn.UNIQUE(_xlfn._xlws.FILTER(ct_01[Floor Temperature Limit °C],ct_01[Zone Application Type]=ZoneTypes!G24,\"\")))","v":"N/A"}]
[{"$f":"TRANSPOSE(_xlfn.UNIQUE(_xlfn._xlws.FILTER(ct_01[Floor Temperature Limit °C],ct_01[Zone Application Type]=ZoneTypes!G25,\"\")))","v":"PLEASE SELECT"},"TBA","25 °C","26 °C","27 °C","28 °C","29 °C","30 °C","31 °C","32 °C","33 °C","34 °C","35 °C","36 °C","37 °C","38 °C","39 °C","40 °C"]
[{"$f":"TRANSPOSE(_xlfn.UNIQUE(_xlfn._xlws.FILTER(ct_01[Floor Temperature Limit °C],ct_01[Zone Application Type]=ZoneTypes!G26,\"\")))","v":"N/A"}]
[{"$f":"TRANSPOSE(_xlfn.UNIQUE(_xlfn._xlws.FILTER(ct_01[Floor Temperature Limit °C],ct_01[Zone Application Type]=ZoneTypes!G27,\"\")))","v":"N/A"}]
[{"$f":"TRANSPOSE(_xlfn.UNIQUE(_xlfn._xlws.FILTER(ct_01[Floor Temperature Limit °C],ct_01[Zone Application Type]=ZoneTypes!G28,\"\")))","v":"N/A"}]
[{"$f":"TRANSPOSE(_xlfn.UNIQUE(_xlfn._xlws.FILTER(ct_01[Floor Temperature Limit °C],ct_01[Zone Application Type]=ZoneTypes!G29,\"\")))","v":"PLEASE SELECT"},"TBA","25 °C","26 °C","27 °C","28 °C","29 °C","30 °C","31 °C","32 °C","33 °C","34 °C","35 °C","36 °C","37 °C","38 °C","39 °C","40 °C"]
[{"$f":"TRANSPOSE(_xlfn.UNIQUE(_xlfn._xlws.FILTER(ct_01[Floor Temperature Limit °C],ct_01[Zone Application Type]=ZoneTypes!G30,\"\")))","v":"N/A"}]
[{"$f":"TRANSPOSE(_xlfn.UNIQUE(_xlfn._xlws.FILTER(ct_01[Floor Temperature Limit °C],ct_01[Zone Application Type]=ZoneTypes!G31,\"\")))","v":"PLEASE SELECT"},"TBA","25 °C","26 °C","27 °C","28 °C","29 °C","30 °C","31 °C","32 °C","33 °C","34 °C","35 °C","36 °C","37 °C","38 °C","39 °C","40 °C"]
[{"$f":"TRANSPOSE(_xlfn.UNIQUE(_xlfn._xlws.FILTER(ct_01[Floor Temperature Limit °C],ct_01[Zone Application Type]=ZoneTypes!G32,\"\")))","v":"N/A"}]
[{"$f":"TRANSPOSE(_xlfn.UNIQUE(_xlfn._xlws.FILTER(ct_01[Floor Temperature Limit °C],ct_01[Zone Application Type]=ZoneTypes!G33,\"\")))","v":"N/A"}]
[{"$f":"TRANSPOSE(_xlfn.UNIQUE(_xlfn._xlws.FILTER(ct_01[Floor Temperature Limit °C],ct_01[Zone Application Type]=ZoneTypes!G34,\"\")))","v":""}]
[{"$f":"TRANSPOSE(_xlfn.UNIQUE(_xlfn._xlws.FILTER(ct_01[Floor Temperature Limit °C],ct_01[Zone Application Type]=ZoneTypes!G35,\"\")))","v":"First Select Zone Application Type"}]
[{"$f":"TRANSPOSE(_xlfn.UNIQUE(_xlfn._xlws.FILTER(ct_01[Floor Temperature Limit °C],ct_01[Zone Application Type]=ZoneTypes!G36,\"\")))","v":"First Select Zone Application Type"}]
[{"$f":"TRANSPOSE(_xlfn.UNIQUE(_xlfn._xlws.FILTER(ct_01[Floor Temperature Limit °C],ct_01[Zone Application Type]=ZoneTypes!G37,\"\")))","v":"First Select Zone Application Type"}]
[{"$f":"TRANSPOSE(_xlfn.UNIQUE(_xlfn._xlws.FILTER(ct_01[Floor Temperature Limit °C],ct_01[Zone Application Type]=ZoneTypes!G38,\"\")))","v":"First Select Zone Application Type"}]
[{"$f":"TRANSPOSE(_xlfn.UNIQUE(_xlfn._xlws.FILTER(ct_01[Floor Temperature Limit °C],ct_01[Zone Application Type]=ZoneTypes!G39,\"\")))","v":"First Select Zone Application Type"}]
[{"$f":"TRANSPOSE(_xlfn.UNIQUE(_xlfn._xlws.FILTER(ct_01[Floor Temperature Limit °C],ct_01[Zone Application Type]=ZoneTypes!G40,\"\")))","v":"First Select Zone Application Type"}]
[{"$f":"TRANSPOSE(_xlfn.UNIQUE(_xlfn._xlws.FILTER(ct_01[Floor Temperature Limit °C],ct_01[Zone Application Type]=ZoneTypes!G41,\"\")))","v":"First Select Zone Application Type"}]
[{"$f":"TRANSPOSE(_xlfn.UNIQUE(_xlfn._xlws.FILTER(ct_01[Floor Temperature Limit °C],ct_01[Zone Application Type]=ZoneTypes!G42,\"\")))","v":"First Select Zone Application Type"}]
[{"$f":"TRANSPOSE(_xlfn.UNIQUE(_xlfn._xlws.FILTER(ct_01[Floor Temperature Limit °C],ct_01[Zone Application Type]=ZoneTypes!G43,\"\")))","v":"First Select Zone Application Type"}]
[{"$f":"TRANSPOSE(_xlfn.UNIQUE(_xlfn._xlws.FILTER(ct_01[Floor Temperature Limit °C],ct_01[Zone Application Type]=ZoneTypes!G44,\"\")))","v":"First Select Zone Application Type"}]
[{"$f":"TRANSPOSE(_xlfn.UNIQUE(_xlfn._xlws.FILTER(ct_01[Floor Temperature Limit °C],ct_01[Zone Application Type]=ZoneTypes!G45,\"\")))","v":"First Select Zone Application Type"}]
[{"$f":"TRANSPOSE(_xlfn.UNIQUE(_xlfn._xlws.FILTER(ct_01[Floor Temperature Limit °C],ct_01[Zone Application Type]=ZoneTypes!G46,\"\")))","v":"First Select Zone Application Type"}]
[{"$f":"TRANSPOSE(_xlfn.UNIQUE(_xlfn._xlws.FILTER(ct_01[Floor Temperature Limit °C],ct_01[Zone Application Type]=ZoneTypes!G47,\"\")))","v":"First Select Zone Application Type"}]
[{"$f":"TRANSPOSE(_xlfn.UNIQUE(_xlfn._xlws.FILTER(ct_01[Floor Temperature Limit °C],ct_01[Zone Application Type]=ZoneTypes!G48,\"\")))","v":"First Select Zone Application Type"}]
[{"$f":"TRANSPOSE(_xlfn.UNIQUE(_xlfn._xlws.FILTER(ct_01[Floor Temperature Limit °C],ct_01[Zone Application Type]=ZoneTypes!G49,\"\")))","v":"First Select Zone Application Type"}]
[{"$f":"TRANSPOSE(_xlfn.UNIQUE(_xlfn._xlws.FILTER(ct_01[Floor Temperature Limit °C],ct_01[Zone Application Type]=ZoneTypes!G50,\"\")))","v":"First Select Zone Application Type"}]
[{"$f":"TRANSPOSE(_xlfn.UNIQUE(_xlfn._xlws.FILTER(ct_01[Floor Temperature Limit °C],ct_01[Zone Application Type]=ZoneTypes!G51,\"\")))","v":"First Select Zone Application Type"}]
[{"$f":"TRANSPOSE(_xlfn.UNIQUE(_xlfn._xlws.FILTER(ct_01[Floor Temperature Limit °C],ct_01[Zone Application Type]=ZoneTypes!G52,\"\")))","v":"First Select Zone Application Type"}]
[{"$f":"TRANSPOSE(_xlfn.UNIQUE(_xlfn._xlws.FILTER(ct_01[Floor Temperature Limit °C],ct_01[Zone Application Type]=ZoneTypes!G53,\"\")))","v":"First Select Zone Application Type"}]
[{"$f":"TRANSPOSE(_xlfn.UNIQUE(_xlfn._xlws.FILTER(ct_01[Floor Temperature Limit °C],ct_01[Zone Application Type]=ZoneTypes!G54,\"\")))","v":"First Select Zone Application Type"}]
[{"$f":"TRANSPOSE(_xlfn.UNIQUE(_xlfn._xlws.FILTER(ct_01[Floor Temperature Limit °C],ct_01[Zone Application Type]=ZoneTypes!G55,\"\")))","v":"First Select Zone Application Type"}]
[{"$f":"TRANSPOSE(_xlfn.UNIQUE(_xlfn._xlws.FILTER(ct_01[Floor Temperature Limit °C],ct_01[Zone Application Type]=ZoneTypes!G56,\"\")))","v":"First Select Zone Application Type"}]
[{"$f":"TRANSPOSE(_xlfn.UNIQUE(_xlfn._xlws.FILTER(ct_01[Floor Temperature Limit °C],ct_01[Zone Application Type]=ZoneTypes!G57,\"\")))","v":"First Select Zone Application Type"}]
[{"$f":"TRANSPOSE(_xlfn.UNIQUE(_xlfn._xlws.FILTER(ct_01[Floor Temperature Limit °C],ct_01[Zone Application Type]=ZoneTypes!G58,\"\")))","v":"First Select Zone Application Type"}]
[{"$f":"TRANSPOSE(_xlfn.UNIQUE(_xlfn._xlws.FILTER(ct_01[Floor Temperature Limit °C],ct_01[Zone Application Type]=ZoneTypes!G59,\"\")))","v":"First Select Zone Application Type"}]
[{"$f":"TRANSPOSE(_xlfn.UNIQUE(_xlfn._xlws.FILTER(ct_01[Floor Temperature Limit °C],ct_01[Zone Application Type]=ZoneTypes!G60,\"\")))","v":"First Select Zone Application Type"}]
[{"$f":"TRANSPOSE(_xlfn.UNIQUE(_xlfn._xlws.FILTER(ct_01[Floor Temperature Limit °C],ct_01[Zone Application Type]=ZoneTypes!G61,\"\")))","v":"First Select Zone Application Type"}]
[{"$f":"TRANSPOSE(_xlfn.UNIQUE(_xlfn._xlws.FILTER(ct_01[Floor Temperature Limit °C],ct_01[Zone Application Type]=ZoneTypes!G62,\"\")))","v":"First Select Zone Application Type"}]
[{"$f":"TRANSPOSE(_xlfn.UNIQUE(_xlfn._xlws.FILTER(ct_01[Floor Temperature Limit °C],ct_01[Zone Application Type]=ZoneTypes!G63,\"\")))","v":"First Select Zone Application Type"}]
[{"$f":"TRANSPOSE(_xlfn.UNIQUE(_xlfn._xlws.FILTER(ct_01[Floor Temperature Limit °C],ct_01[Zone Application Type]=ZoneTypes!G64,\"\")))","v":"First Select Zone Application Type"}]
[{"$f":"TRANSPOSE(_xlfn.UNIQUE(_xlfn._xlws.FILTER(ct_01[Floor Temperature Limit °C],ct_01[Zone Application Type]=ZoneTypes!G65,\"\")))","v":"First Select Zone Application Type"}]
[{"$f":"TRANSPOSE(_xlfn.UNIQUE(_xlfn._xlws.FILTER(ct_01[Floor Temperature Limit °C],ct_01[Zone Application Type]=ZoneTypes!G66,\"\")))","v":"First Select Zone Application Type"}]
[{"$f":"TRANSPOSE(_xlfn.UNIQUE(_xlfn._xlws.FILTER(ct_01[Floor Temperature Limit °C],ct_01[Zone Application Type]=ZoneTypes!G67,\"\")))","v":"First Select Zone Application Type"}]
[{"$f":"TRANSPOSE(_xlfn.UNIQUE(_xlfn._xlws.FILTER(ct_01[Floor Temperature Limit °C],ct_01[Zone Application Type]=ZoneTypes!G68,\"\")))","v":"First Select Zone Application Type"}]
[{"$f":"TRANSPOSE(_xlfn.UNIQUE(_xlfn._xlws.FILTER(ct_01[Floor Temperature Limit °C],ct_01[Zone Application Type]=ZoneTypes!G69,\"\")))","v":"First Select Zone Application Type"}]
[{"$f":"TRANSPOSE(_xlfn.UNIQUE(_xlfn._xlws.FILTER(ct_01[Floor Temperature Limit °C],ct_01[Zone Application Type]=ZoneTypes!G70,\"\")))","v":"First Select Zone Application Type"}]
[{"$f":"TRANSPOSE(_xlfn.UNIQUE(_xlfn._xlws.FILTER(ct_01[Floor Temperature Limit °C],ct_01[Zone Application Type]=ZoneTypes!G71,\"\")))","v":"First Select Zone Application Type"}]
[{"$f":"TRANSPOSE(_xlfn.UNIQUE(_xlfn._xlws.FILTER(ct_01[Floor Temperature Limit °C],ct_01[Zone Application Type]=ZoneTypes!G72,\"\")))","v":"First Select Zone Application Type"}]
[{"$f":"TRANSPOSE(_xlfn.UNIQUE(_xlfn._xlws.FILTER(ct_01[Floor Temperature Limit °C],ct_01[Zone Application Type]=ZoneTypes!G73,\"\")))","v":"First Select Zone Application Type"}]
[{"$f":"TRANSPOSE(_xlfn.UNIQUE(_xlfn._xlws.FILTER(ct_01[Floor Temperature Limit °C],ct_01[Zone Application Type]=ZoneTypes!G74,\"\")))","v":"First Select Zone Application Type"}]
[{"$f":"TRANSPOSE(_xlfn.UNIQUE(_xlfn._xlws.FILTER(ct_01[Floor Temperature Limit °C],ct_01[Zone Application Type]=ZoneTypes!G75,\"\")))","v":"First Select Zone Application Type"}]
[{"$f":"TRANSPOSE(_xlfn.UNIQUE(_xlfn._xlws.FILTER(ct_01[Floor Temperature Limit °C],ct_01[Zone Application Type]=ZoneTypes!G76,\"\")))","v":"First Select Zone Application Type"}]
[{"$f":"TRANSPOSE(_xlfn.UNIQUE(_xlfn._xlws.FILTER(ct_01[Floor Temperature Limit °C],ct_01[Zone Application Type]=ZoneTypes!G77,\"\")))","v":"First Select Zone Application Type"}]
[{"$f":"TRANSPOSE(_xlfn.UNIQUE(_xlfn._xlws.FILTER(ct_01[Floor Temperature Limit °C],ct_01[Zone Application Type]=ZoneTypes!G78,\"\")))","v":"First Select Zone Application Type"}]
[{"$f":"TRANSPOSE(_xlfn.UNIQUE(_xlfn._xlws.FILTER(ct_01[Floor Temperature Limit °C],ct_01[Zone Application Type]=ZoneTypes!G79,\"\")))","v":"First Select Zone Application Type"}]
[{"$f":"TRANSPOSE(_xlfn.UNIQUE(_xlfn._xlws.FILTER(ct_01[Floor Temperature Limit °C],ct_01[Zone Application Type]=ZoneTypes!G80,\"\")))","v":"First Select Zone Application Type"}]
[{"$f":"TRANSPOSE(_xlfn.UNIQUE(_xlfn._xlws.FILTER(ct_01[Floor Temperature Limit °C],ct_01[Zone Application Type]=ZoneTypes!G81,\"\")))","v":"First Select Zone Application Type"}]
[{"$f":"TRANSPOSE(_xlfn.UNIQUE(_xlfn._xlws.FILTER(ct_01[Floor Temperature Limit °C],ct_01[Zone Application Type]=ZoneTypes!G82,\"\")))","v":"First Select Zone Application Type"}]
[{"$f":"TRANSPOSE(_xlfn.UNIQUE(_xlfn._xlws.FILTER(ct_01[Floor Temperature Limit °C],ct_01[Zone Application Type]=ZoneTypes!G83,\"\")))","v":"First Select Zone Application Type"}]
[{"$f":"TRANSPOSE(_xlfn.UNIQUE(_xlfn._xlws.FILTER(ct_01[Floor Temperature Limit °C],ct_01[Zone Application Type]=ZoneTypes!G84,\"\")))","v":"First Select Zone Application Type"}]
[{"$f":"TRANSPOSE(_xlfn.UNIQUE(_xlfn._xlws.FILTER(ct_01[Floor Temperature Limit °C],ct_01[Zone Application Type]=ZoneTypes!G85,\"\")))","v":"First Select Zone Application Type"}]
[{"$f":"TRANSPOSE(_xlfn.UNIQUE(_xlfn._xlws.FILTER(ct_01[Floor Temperature Limit °C],ct_01[Zone Application Type]=ZoneTypes!G86,\"\")))","v":"First Select Zone Application Type"}]
[{"$f":"TRANSPOSE(_xlfn.UNIQUE(_xlfn._xlws.FILTER(ct_01[Floor Temperature Limit °C],ct_01[Zone Application Type]=ZoneTypes!G87,\"\")))","v":"First Select Zone Application Type"}]
[{"$f":"TRANSPOSE(_xlfn.UNIQUE(_xlfn._xlws.FILTER(ct_01[Floor Temperature Limit °C],ct_01[Zone Application Type]=ZoneTypes!G88,\"\")))","v":"First Select Zone Application Type"}]
[{"$f":"TRANSPOSE(_xlfn.UNIQUE(_xlfn._xlws.FILTER(ct_01[Floor Temperature Limit °C],ct_01[Zone Application Type]=ZoneTypes!G89,\"\")))","v":"First Select Zone Application Type"}]
[{"$f":"TRANSPOSE(_xlfn.UNIQUE(_xlfn._xlws.FILTER(ct_01[Floor Temperature Limit °C],ct_01[Zone Application Type]=ZoneTypes!G90,\"\")))","v":"First Select Zone Application Type"}]
[{"$f":"TRANSPOSE(_xlfn.UNIQUE(_xlfn._xlws.FILTER(ct_01[Floor Temperature Limit °C],ct_01[Zone Application Type]=ZoneTypes!G91,\"\")))","v":"First Select Zone Application Type"}]
[{"$f":"TRANSPOSE(_xlfn.UNIQUE(_xlfn._xlws.FILTER(ct_01[Floor Temperature Limit °C],ct_01[Zone Application Type]=ZoneTypes!G92,\"\")))","v":"First Select Zone Application Type"}]
[{"$f":"TRANSPOSE(_xlfn.UNIQUE(_xlfn._xlws.FILTER(ct_01[Floor Temperature Limit °C],ct_01[Zone Application Type]=ZoneTypes!G93,\"\")))","v":"First Select Zone Application Type"}]
[{"$f":"TRANSPOSE(_xlfn.UNIQUE(_xlfn._xlws.FILTER(ct_01[Floor Temperature Limit °C],ct_01[Zone Application Type]=ZoneTypes!G94,\"\")))","v":"First Select Zone Application Type"}]
[{"$f":"TRANSPOSE(_xlfn.UNIQUE(_xlfn._xlws.FILTER(ct_01[Floor Temperature Limit °C],ct_01[Zone Application Type]=ZoneTypes!G95,\"\")))","v":"First Select Zone Application Type"}]
[{"$f":"TRANSPOSE(_xlfn.UNIQUE(_xlfn._xlws.FILTER(ct_01[Floor Temperature Limit °C],ct_01[Zone Application Type]=ZoneTypes!G96,\"\")))","v":"First Select Zone Application Type"}]
[{"$f":"TRANSPOSE(_xlfn.UNIQUE(_xlfn._xlws.FILTER(ct_01[Floor Temperature Limit °C],ct_01[Zone Application Type]=ZoneTypes!G97,\"\")))","v":"First Select Zone Application Type"}]
[{"$f":"TRANSPOSE(_xlfn.UNIQUE(_xlfn._xlws.FILTER(ct_01[Floor Temperature Limit °C],ct_01[Zone Application Type]=ZoneTypes!G98,\"\")))","v":"First Select Zone Application Type"}]
[{"$f":"TRANSPOSE(_xlfn.UNIQUE(_xlfn._xlws.FILTER(ct_01[Floor Temperature Limit °C],ct_01[Zone Application Type]=ZoneTypes!G99,\"\")))","v":"First Select Zone Application Type"}]
[{"$f":"TRANSPOSE(_xlfn.UNIQUE(_xlfn._xlws.FILTER(ct_01[Floor Temperature Limit °C],ct_01[Zone Application Type]=ZoneTypes!G100,\"\")))","v":"First Select Zone Application Type"}]
[{"$f":"TRANSPOSE(_xlfn.UNIQUE(_xlfn._xlws.FILTER(ct_01[Floor Temperature Limit °C],ct_01[Zone Application Type]=ZoneTypes!G101,\"\")))","v":"First Select Zone Application Type"}]
[{"$f":"TRANSPOSE(_xlfn.UNIQUE(_xlfn._xlws.FILTER(ct_01[Floor Temperature Limit °C],ct_01[Zone Application Type]=ZoneTypes!G102,\"\")))","v":"First Select Zone Application Type"}]
[{"$f":"TRANSPOSE(_xlfn.UNIQUE(_xlfn._xlws.FILTER(ct_01[Floor Temperature Limit °C],ct_01[Zone Application Type]=ZoneTypes!G103,\"\")))","v":"First Select Zone Application Type"}]
[{"$f":"TRANSPOSE(_xlfn.UNIQUE(_xlfn._xlws.FILTER(ct_01[Floor Temperature Limit °C],ct_01[Zone Application Type]=ZoneTypes!G104,\"\")))","v":"First Select Zone Application Type"}]
[{"$f":"TRANSPOSE(_xlfn.UNIQUE(_xlfn._xlws.FILTER(ct_01[Floor Temperature Limit °C],ct_01[Zone Application Type]=ZoneTypes!G105,\"\")))","v":"First Select Zone Application Type"}]
[{"$f":"TRANSPOSE(_xlfn.UNIQUE(_xlfn._xlws.FILTER(ct_01[Floor Temperature Limit °C],ct_01[Zone Application Type]=ZoneTypes!G106,\"\")))","v":"First Select Zone Application Type"}]
[{"$f":"TRANSPOSE(_xlfn.UNIQUE(_xlfn._xlws.FILTER(ct_01[Floor Temperature Limit °C],ct_01[Zone Application Type]=ZoneTypes!G107,\"\")))","v":"First Select Zone Application Type"}]
[{"$f":"TRANSPOSE(_xlfn.UNIQUE(_xlfn._xlws.FILTER(ct_01[Floor Temperature Limit °C],ct_01[Zone Application Type]=ZoneTypes!G108,\"\")))","v":"First Select Zone Application Type"}]
[{"$f":"TRANSPOSE(_xlfn.UNIQUE(_xlfn._xlws.FILTER(ct_01[Floor Temperature Limit °C],ct_01[Zone Application Type]=ZoneTypes!G109,\"\")))","v":"First Select Zone Application Type"}]
[{"$f":"TRANSPOSE(_xlfn.UNIQUE(_xlfn._xlws.FILTER(ct_01[Floor Temperature Limit °C],ct_01[Zone Application Type]=ZoneTypes!G110,\"\")))","v":"First Select Zone Application Type"}]
[{"$f":"TRANSPOSE(_xlfn.UNIQUE(_xlfn._xlws.FILTER(ct_01[Floor Temperature Limit °C],ct_01[Zone Application Type]=ZoneTypes!G111,\"\")))","v":"First Select Zone Application Type"}]
[{"$f":"TRANSPOSE(_xlfn.UNIQUE(_xlfn._xlws.FILTER(ct_01[Floor Temperature Limit °C],ct_01[Zone Application Type]=ZoneTypes!G112,\"\")))","v":"First Select Zone Application Type"}]
[{"$f":"TRANSPOSE(_xlfn.UNIQUE(_xlfn._xlws.FILTER(ct_01[Floor Temperature Limit °C],ct_01[Zone Application Type]=ZoneTypes!G113,\"\")))","v":"First Select Zone Application Type"}]
[{"$f":"TRANSPOSE(_xlfn.UNIQUE(_xlfn._xlws.FILTER(ct_01[Floor Temperature Limit °C],ct_01[Zone Application Type]=ZoneTypes!G114,\"\")))","v":"First Select Zone Application Type"}]
[{"$f":"TRANSPOSE(_xlfn.UNIQUE(_xlfn._xlws.FILTER(ct_01[Floor Temperature Limit °C],ct_01[Zone Application Type]=ZoneTypes!G115,\"\")))","v":"First Select Zone Application Type"}]
[{"$f":"TRANSPOSE(_xlfn.UNIQUE(_xlfn._xlws.FILTER(ct_01[Floor Temperature Limit °C],ct_01[Zone Application Type]=ZoneTypes!G116,\"\")))","v":"First Select Zone Application Type"}]
[{"$f":"TRANSPOSE(_xlfn.UNIQUE(_xlfn._xlws.FILTER(ct_01[Floor Temperature Limit °C],ct_01[Zone Application Type]=ZoneTypes!G117,\"\")))","v":"First Select Zone Application Type"}]
[{"$f":"TRANSPOSE(_xlfn.UNIQUE(_xlfn._xlws.FILTER(ct_01[Floor Temperature Limit °C],ct_01[Zone Application Type]=ZoneTypes!G118,\"\")))","v":"First Select Zone Application Type"}]
[{"$f":"TRANSPOSE(_xlfn.UNIQUE(_xlfn._xlws.FILTER(ct_01[Floor Temperature Limit °C],ct_01[Zone Application Type]=ZoneTypes!G119,\"\")))","v":"First Select Zone Application Type"}]
[{"$f":"TRANSPOSE(_xlfn.UNIQUE(_xlfn._xlws.FILTER(ct_01[Floor Temperature Limit °C],ct_01[Zone Application Type]=ZoneTypes!G120,\"\")))","v":"First Select Zone Application Type"}]
[{"$f":"TRANSPOSE(_xlfn.UNIQUE(_xlfn._xlws.FILTER(ct_01[Floor Temperature Limit °C],ct_01[Zone Application Type]=ZoneTypes!G121,\"\")))","v":"First Select Zone Application Type"}]
[{"$f":"TRANSPOSE(_xlfn.UNIQUE(_xlfn._xlws.FILTER(ct_01[Floor Temperature Limit °C],ct_01[Zone Application Type]=ZoneTypes!G122,\"\")))","v":"First Select Zone Application Type"}]
[{"$f":"TRANSPOSE(_xlfn.UNIQUE(_xlfn._xlws.FILTER(ct_01[Floor Temperature Limit °C],ct_01[Zone Application Type]=ZoneTypes!G123,\"\")))","v":"First Select Zone Application Type"}]
[{"$f":"TRANSPOSE(_xlfn.UNIQUE(_xlfn._xlws.FILTER(ct_01[Floor Temperature Limit °C],ct_01[Zone Application Type]=ZoneTypes!G124,\"\")))","v":"First Select Zone Application Type"}]
[{"$f":"TRANSPOSE(_xlfn.UNIQUE(_xlfn._xlws.FILTER(ct_01[Floor Temperature Limit °C],ct_01[Zone Application Type]=ZoneTypes!G125,\"\")))","v":"First Select Zone Application Type"}]
[{"$f":"TRANSPOSE(_xlfn.UNIQUE(_xlfn._xlws.FILTER(ct_01[Floor Temperature Limit °C],ct_01[Zone Application Type]=ZoneTypes!G126,\"\")))","v":"First Select Zone Application Type"}]
[{"$f":"TRANSPOSE(_xlfn.UNIQUE(_xlfn._xlws.FILTER(ct_01[Floor Temperature Limit °C],ct_01[Zone Application Type]=ZoneTypes!G127,\"\")))","v":"First Select Zone Application Type"}]
[{"$f":"TRANSPOSE(_xlfn.UNIQUE(_xlfn._xlws.FILTER(ct_01[Floor Temperature Limit °C],ct_01[Zone Application Type]=ZoneTypes!G128,\"\")))","v":"First Select Zone Application Type"}]
[{"$f":"TRANSPOSE(_xlfn.UNIQUE(_xlfn._xlws.FILTER(ct_01[Floor Temperature Limit °C],ct_01[Zone Application Type]=ZoneTypes!G129,\"\")))","v":"First Select Zone Application Type"}]
[{"$f":"TRANSPOSE(_xlfn.UNIQUE(_xlfn._xlws.FILTER(ct_01[Floor Temperature Limit °C],ct_01[Zone Application Type]=ZoneTypes!G130,\"\")))","v":"First Select Zone Application Type"}]
[{"$f":"TRANSPOSE(_xlfn.UNIQUE(_xlfn._xlws.FILTER(ct_01[Floor Temperature Limit °C],ct_01[Zone Application Type]=ZoneTypes!G131,\"\")))","v":"First Select Zone Application Type"}]
[{"$f":"TRANSPOSE(_xlfn.UNIQUE(_xlfn._xlws.FILTER(ct_01[Floor Temperature Limit °C],ct_01[Zone Application Type]=ZoneTypes!G132,\"\")))","v":"First Select Zone Application Type"}]
[{"$f":"TRANSPOSE(_xlfn.UNIQUE(_xlfn._xlws.FILTER(ct_01[Floor Temperature Limit °C],ct_01[Zone Application Type]=ZoneTypes!G133,\"\")))","v":"First Select Zone Application Type"}]
[{"$f":"TRANSPOSE(_xlfn.UNIQUE(_xlfn._xlws.FILTER(ct_01[Floor Temperature Limit °C],ct_01[Zone Application Type]=ZoneTypes!G134,\"\")))","v":"First Select Zone Application Type"}]
[{"$f":"TRANSPOSE(_xlfn.UNIQUE(_xlfn._xlws.FILTER(ct_01[Floor Temperature Limit °C],ct_01[Zone Application Type]=ZoneTypes!G135,\"\")))","v":"First Select Zone Application Type"}]
[{"$f":"TRANSPOSE(_xlfn.UNIQUE(_xlfn._xlws.FILTER(ct_01[Floor Temperature Limit °C],ct_01[Zone Application Type]=ZoneTypes!G136,\"\")))","v":"First Select Zone Application Type"}]
[{"$f":"TRANSPOSE(_xlfn.UNIQUE(_xlfn._xlws.FILTER(ct_01[Floor Temperature Limit °C],ct_01[Zone Application Type]=ZoneTypes!G137,\"\")))","v":"First Select Zone Application Type"}]
[{"$f":"TRANSPOSE(_xlfn.UNIQUE(_xlfn._xlws.FILTER(ct_01[Floor Temperature Limit °C],ct_01[Zone Application Type]=ZoneTypes!G138,\"\")))","v":"First Select Zone Application Type"}]
[{"$f":"TRANSPOSE(_xlfn.UNIQUE(_xlfn._xlws.FILTER(ct_01[Floor Temperature Limit °C],ct_01[Zone Application Type]=ZoneTypes!G139,\"\")))","v":"First Select Zone Application Type"}]
[{"$f":"TRANSPOSE(_xlfn.UNIQUE(_xlfn._xlws.FILTER(ct_01[Floor Temperature Limit °C],ct_01[Zone Application Type]=ZoneTypes!G140,\"\")))","v":"First Select Zone Application Type"}]
[{"$f":"TRANSPOSE(_xlfn.UNIQUE(_xlfn._xlws.FILTER(ct_01[Floor Temperature Limit °C],ct_01[Zone Application Type]=ZoneTypes!G141,\"\")))","v":"First Select Zone Application Type"}]
[{"$f":"TRANSPOSE(_xlfn.UNIQUE(_xlfn._xlws.FILTER(ct_01[Floor Temperature Limit °C],ct_01[Zone Application Type]=ZoneTypes!G142,\"\")))","v":"First Select Zone Application Type"}]
[{"$f":"TRANSPOSE(_xlfn.UNIQUE(_xlfn._xlws.FILTER(ct_01[Floor Temperature Limit °C],ct_01[Zone Application Type]=ZoneTypes!G143,\"\")))","v":"First Select Zone Application Type"}]
[{"$f":"TRANSPOSE(_xlfn.UNIQUE(_xlfn._xlws.FILTER(ct_01[Floor Temperature Limit °C],ct_01[Zone Application Type]=ZoneTypes!G144,\"\")))","v":"First Select Zone Application Type"}]
[{"$f":"TRANSPOSE(_xlfn.UNIQUE(_xlfn._xlws.FILTER(ct_01[Floor Temperature Limit °C],ct_01[Zone Application Type]=ZoneTypes!G145,\"\")))","v":"First Select Zone Application Type"}]
[{"$f":"TRANSPOSE(_xlfn.UNIQUE(_xlfn._xlws.FILTER(ct_01[Floor Temperature Limit °C],ct_01[Zone Application Type]=ZoneTypes!G146,\"\")))","v":"First Select Zone Application Type"}]
[{"$f":"TRANSPOSE(_xlfn.UNIQUE(_xlfn._xlws.FILTER(ct_01[Floor Temperature Limit °C],ct_01[Zone Application Type]=ZoneTypes!G147,\"\")))","v":"First Select Zone Application Type"}]
[{"$f":"TRANSPOSE(_xlfn.UNIQUE(_xlfn._xlws.FILTER(ct_01[Floor Temperature Limit °C],ct_01[Zone Application Type]=ZoneTypes!G148,\"\")))","v":"First Select Zone Application Type"}]
[{"$f":"TRANSPOSE(_xlfn.UNIQUE(_xlfn._xlws.FILTER(ct_01[Floor Temperature Limit °C],ct_01[Zone Application Type]=ZoneTypes!G149,\"\")))","v":"First Select Zone Application Type"}]
[{"$f":"TRANSPOSE(_xlfn.UNIQUE(_xlfn._xlws.FILTER(ct_01[Floor Temperature Limit °C],ct_01[Zone Application Type]=ZoneTypes!G150,\"\")))","v":"First Select Zone Application Type"}]
[{"$f":"TRANSPOSE(_xlfn.UNIQUE(_xlfn._xlws.FILTER(ct_01[Floor Temperature Limit °C],ct_01[Zone Application Type]=ZoneTypes!G151,\"\")))","v":"First Select Zone Application Type"}]
[{"$f":"TRANSPOSE(_xlfn.UNIQUE(_xlfn._xlws.FILTER(ct_01[Floor Temperature Limit °C],ct_01[Zone Application Type]=ZoneTypes!G152,\"\")))","v":"First Select Zone Application Type"}]
[{"$f":"TRANSPOSE(_xlfn.UNIQUE(_xlfn._xlws.FILTER(ct_01[Floor Temperature Limit °C],ct_01[Zone Application Type]=ZoneTypes!G153,\"\")))","v":"First Select Zone Application Type"}]
[{"$f":"TRANSPOSE(_xlfn.UNIQUE(_xlfn._xlws.FILTER(ct_01[Floor Temperature Limit °C],ct_01[Zone Application Type]=ZoneTypes!G154,\"\")))","v":"First Select Zone Application Type"}]
[{"$f":"TRANSPOSE(_xlfn.UNIQUE(_xlfn._xlws.FILTER(ct_01[Floor Temperature Limit °C],ct_01[Zone Application Type]=ZoneTypes!G155,\"\")))","v":"First Select Zone Application Type"}]
[{"$f":"TRANSPOSE(_xlfn.UNIQUE(_xlfn._xlws.FILTER(ct_01[Floor Temperature Limit °C],ct_01[Zone Application Type]=ZoneTypes!G156,\"\")))","v":"First Select Zone Application Type"}]
[{"$error":"#REF!"}]
[{"$error":"#REF!"}]
[{"$error":"#REF!"}]
[{"$error":"#REF!"}]
[{"$error":"#REF!"}]
[{"$error":"#REF!"}]
[{"$error":"#REF!"}]
[{"$error":"#REF!"}]
[{"$error":"#REF!"}]
[{"$error":"#REF!"}]
[{"$error":"#REF!"}]
[{"$error":"#REF!"}]
[{"$error":"#REF!"}]
[{"$error":"#REF!"}]
[{"$error":"#REF!"}]
[{"$error":"#REF!"}]
[{"$error":"#REF!"}]
[{"$error":"#REF!"}]
[{"$error":"#REF!"}]
[{"$error":"#REF!"}]
[{"$error":"#REF!"}]
[{"$error":"#REF!"}]
[{"$error":"#REF!"}]
[{"$error":"#REF!"}]
[{"$error":"#REF!"}]
[{"$error":"#REF!"}]
[{"$error":"#REF!"}]
[{"$error":"#REF!"}]
[{"$error":"#REF!"}]
[{"$error":"#REF!"}]
[{"$error":"#REF!"}]
[{"$error":"#REF!"}]
[{"$error":"#REF!"}]
[{"$error":"#REF!"}]
[{"$error":"#REF!"}]
[{"$error":"#REF!"}]
[{"$error":"#REF!"}]
[{"$error":"#REF!"}]
[{"$error":"#REF!"}]
[{"$error":"#REF!"}]
[{"$error":"#REF!"}]
[{"$error":"#REF!"}]
[{"$error":"#REF!"}]
[{"$error":"#REF!"}]
[{"$error":"#REF!"}]
[{"$error":"#REF!"}]
[{"$error":"#REF!"}]
[{"$error":"#REF!"}]
[{"$error":"#REF!"}]
[{"$error":"#REF!"}]
[{"$error":"#REF!"}]
[{"$error":"#REF!"}]
[{"$error":"#REF!"}]
[{"$error":"#REF!"}]
[{"$error":"#REF!"}]
[{"$error":"#REF!"}]
[{"$error":"#REF!"}]
[{"$error":"#REF!"}]
[{"$error":"#REF!"}]
[{"$error":"#REF!"}]
[{"$error":"#REF!"}]
[{"$error":"#REF!"}]
[{"$error":"#REF!"}]
[{"$error":"#REF!"}]
[{"$error":"#REF!"}]
[{"$error":"#REF!"}]
[{"$error":"#REF!"}]
[{"$error":"#REF!"}]
[{"$error":"#REF!"}]
[{"$error":"#REF!"}]
[{"$error":"#REF!"}]
[{"$error":"#REF!"}]
[{"$error":"#REF!"}]
[{"$error":"#REF!"}]
[{"$error":"#REF!"}]
[{"$error":"#REF!"}]
[{"$error":"#REF!"}]
[{"$error":"#REF!"}]
[{"$error":"#REF!"}]
[{"$error":"#REF!"}]
[{"$error":"#REF!"}]
[{"$error":"#REF!"}]
[{"$error":"#REF!"}]
[{"$error":"#REF!"}]
[{"$error":"#REF!"}]
[{"$error":"#REF!"}]
[{"$error":"#REF!"}]
[{"$error":"#REF!"}]
[{"$error":"#REF!"}]
[{"$error":"#REF!"}]
[{"$error":"#REF!"}]
[{"$error":"#REF!"}]
[{"$error":"#REF!"}]
[{"$error":"#REF!"}]
[{"$error":"#REF!"}]
[{"$error":"#REF!"}]
[{"$error":"#REF!"}]
[{"$error":"#REF!"}]
[{"$error":"#REF!"}]
[{"$error":"#REF!"}]
[{"$error":"#REF!"}]
[{"$error":"#REF!"}]
[{"$error":"#REF!"}]
[{"$error":"#REF!"}]
[{"$error":"#REF!"}]
[{"$error":"#REF!"}]
[{"$error":"#REF!"}]
[{"$error":"#REF!"}]
[{"$error":"#REF!"}]
[{"$error":"#REF!"}]
[{"$error":"#REF!"}]
[{"$error":"#REF!"}]
[{"$error":"#REF!"}]
[{"$error":"#REF!"}]
[{"$error":"#REF!"}]
[{"$error":"#REF!"}]
[{"$error":"#REF!"}]
[{"$error":"#REF!"}]
[{"$error":"#REF!"}]
[{"$error":"#REF!"}]
[{"$error":"#REF!"}]
[{"$error":"#REF!"}]
[{"$error":"#REF!"}]
[{"$error":"#REF!"}]
[{"$error":"#REF!"}]
[{"$error":"#REF!"}]
[{"$error":"#REF!"}]
[{"$error":"#REF!"}]
[{"$error":"#REF!"}]
[{"$error":"#REF!"}]
[{"$error":"#REF!"}]
[{"$error":"#REF!"}]
[{"$error":"#REF!"}]
[{"$error":"#REF!"}]
[{"$error":"#REF!"}]
[{"$error":"#REF!"}]
[{"$error":"#REF!"}]
[{"$error":"#REF!"}]
[{"$error":"#REF!"}]
[{"$error":"#REF!"}]
[{"$error":"#REF!"}]
[{"$error":"#REF!"}]
[{"$error":"#REF!"}]
[{"$error":"#REF!"}]
[{"$error":"#REF!"}]
[{"$error":"#REF!"}]
[{"$error":"#REF!"}]
[{"$error":"#REF!"}]
[{"$error":"#REF!"}]
[{"$error":"#REF!"}]
[{"$error":"#REF!"}]
[{"$error":"#REF!"}]
[{"$error":"#REF!"}]

{"sheet":"SpillZTS","index":6,"n_rows":309,"n_cols":4,"rows_kept":309,"hidden":true}
["Dependant Dropdown Spill List"]
["Horizontal Spill for Zone Temperature Sensors"]
[{"$f":"TRANSPOSE(_xlfn.UNIQUE(_xlfn._xlws.FILTER(ct_01[Zone Temp Sensor],ct_01[Zone Application Type]=ZoneTypes!G3,\"\")))","v":"PLEASE SELECT"},"Room Thimble Sensor","AC Unit","Wired Controller"]
[{"$f":"TRANSPOSE(_xlfn.UNIQUE(_xlfn._xlws.FILTER(ct_01[Zone Temp Sensor],ct_01[Zone Application Type]=ZoneTypes!G4,\"\")))","v":"PLEASE SELECT"},"Room Thimble Sensor","AC Unit","Wired Controller"]
[{"$f":"TRANSPOSE(_xlfn.UNIQUE(_xlfn._xlws.FILTER(ct_01[Zone Temp Sensor],ct_01[Zone Application Type]=ZoneTypes!G5,\"\")))","v":"PLEASE SELECT"},"Room Thimble Sensor","AC Unit","Wired Controller"]
[{"$f":"TRANSPOSE(_xlfn.UNIQUE(_xlfn._xlws.FILTER(ct_01[Zone Temp Sensor],ct_01[Zone Application Type]=ZoneTypes!G6,\"\")))","v":"PLEASE SELECT"},"Room Thimble Sensor","AC Unit","Wired Controller"]
[{"$f":"TRANSPOSE(_xlfn.UNIQUE(_xlfn._xlws.FILTER(ct_01[Zone Temp Sensor],ct_01[Zone Application Type]=ZoneTypes!G7,\"\")))","v":"PLEASE SELECT"},"Room Thimble Sensor","AC Unit","Wired Controller"]
[{"$f":"TRANSPOSE(_xlfn.UNIQUE(_xlfn._xlws.FILTER(ct_01[Zone Temp Sensor],ct_01[Zone Application Type]=ZoneTypes!G8,\"\")))","v":"PLEASE SELECT"},"Room Thimble Sensor","AC Unit","Wired Controller"]
[{"$f":"TRANSPOSE(_xlfn.UNIQUE(_xlfn._xlws.FILTER(ct_01[Zone Temp Sensor],ct_01[Zone Application Type]=ZoneTypes!G9,\"\")))","v":"PLEASE SELECT"},"Room Thimble Sensor","Wired Controller"]
[{"$f":"TRANSPOSE(_xlfn.UNIQUE(_xlfn._xlws.FILTER(ct_01[Zone Temp Sensor],ct_01[Zone Application Type]=ZoneTypes!G10,\"\")))","v":"PLEASE SELECT"},"Room Thimble Sensor","Wired Controller"]
[{"$f":"TRANSPOSE(_xlfn.UNIQUE(_xlfn._xlws.FILTER(ct_01[Zone Temp Sensor],ct_01[Zone Application Type]=ZoneTypes!G11,\"\")))","v":"Floor Probe"}]
[{"$f":"TRANSPOSE(_xlfn.UNIQUE(_xlfn._xlws.FILTER(ct_01[Zone Temp Sensor],ct_01[Zone Application Type]=ZoneTypes!G12,\"\")))","v":"PLEASE SELECT"},"Room Thimble Sensor","Wired Controller"]
[{"$f":"TRANSPOSE(_xlfn.UNIQUE(_xlfn._xlws.FILTER(ct_01[Zone Temp Sensor],ct_01[Zone Application Type]=ZoneTypes!G13,\"\")))","v":"PLEASE SELECT"},"Room Thimble Sensor","Wired Controller"]
[{"$f":"TRANSPOSE(_xlfn.UNIQUE(_xlfn._xlws.FILTER(ct_01[Zone Temp Sensor],ct_01[Zone Application Type]=ZoneTypes!G14,\"\")))","v":"Floor Probe"}]
[{"$f":"TRANSPOSE(_xlfn.UNIQUE(_xlfn._xlws.FILTER(ct_01[Zone Temp Sensor],ct_01[Zone Application Type]=ZoneTypes!G15,\"\")))","v":"PLEASE SELECT"},"Room Thimble Sensor","Wired Controller"]
[{"$f":"TRANSPOSE(_xlfn.UNIQUE(_xlfn._xlws.FILTER(ct_01[Zone Temp Sensor],ct_01[Zone Application Type]=ZoneTypes!G16,\"\")))","v":"N/A"}]
[{"$f":"TRANSPOSE(_xlfn.UNIQUE(_xlfn._xlws.FILTER(ct_01[Zone Temp Sensor],ct_01[Zone Application Type]=ZoneTypes!G17,\"\")))","v":"N/A"}]
[{"$f":"TRANSPOSE(_xlfn.UNIQUE(_xlfn._xlws.FILTER(ct_01[Zone Temp Sensor],ct_01[Zone Application Type]=ZoneTypes!G18,\"\")))","v":"PLEASE SELECT"},"Room Thimble Sensor","Wired Controller"]
[{"$f":"TRANSPOSE(_xlfn.UNIQUE(_xlfn._xlws.FILTER(ct_01[Zone Temp Sensor],ct_01[Zone Application Type]=ZoneTypes!G19,\"\")))","v":"N/A"}]
[{"$f":"TRANSPOSE(_xlfn.UNIQUE(_xlfn._xlws.FILTER(ct_01[Zone Temp Sensor],ct_01[Zone Application Type]=ZoneTypes!G20,\"\")))","v":"Cylinder Probe"}]
[{"$f":"TRANSPOSE(_xlfn.UNIQUE(_xlfn._xlws.FILTER(ct_01[Zone Temp Sensor],ct_01[Zone Application Type]=ZoneTypes!G21,\"\")))","v":"Cylinder Probe"}]
[{"$f":"TRANSPOSE(_xlfn.UNIQUE(_xlfn._xlws.FILTER(ct_01[Zone Temp Sensor],ct_01[Zone Application Type]=ZoneTypes!G22,\"\")))","v":"Wired Controller"}]
[{"$f":"TRANSPOSE(_xlfn.UNIQUE(_xlfn._xlws.FILTER(ct_01[Zone Temp Sensor],ct_01[Zone Application Type]=ZoneTypes!G23,\"\")))","v":"Wired Controller"}]
[{"$f":"TRANSPOSE(_xlfn.UNIQUE(_xlfn._xlws.FILTER(ct_01[Zone Temp Sensor],ct_01[Zone Application Type]=ZoneTypes!G24,\"\")))","v":"Wired Controller"}]
[{"$f":"TRANSPOSE(_xlfn.UNIQUE(_xlfn._xlws.FILTER(ct_01[Zone Temp Sensor],ct_01[Zone Application Type]=ZoneTypes!G25,\"\")))","v":"Wired Controller"}]
[{"$f":"TRANSPOSE(_xlfn.UNIQUE(_xlfn._xlws.FILTER(ct_01[Zone Temp Sensor],ct_01[Zone Application Type]=ZoneTypes!G26,\"\")))","v":"Wired Controller"}]
[{"$f":"TRANSPOSE(_xlfn.UNIQUE(_xlfn._xlws.FILTER(ct_01[Zone Temp Sensor],ct_01[Zone Application Type]=ZoneTypes!G27,\"\")))","v":"Wired Controller"}]
[{"$f":"TRANSPOSE(_xlfn.UNIQUE(_xlfn._xlws.FILTER(ct_01[Zone Temp Sensor],ct_01[Zone Application Type]=ZoneTypes!G28,\"\")))","v":"ClimateSync Room Sensor"}]
[{"$f":"TRANSPOSE(_xlfn.UNIQUE(_xlfn._xlws.FILTER(ct_01[Zone Temp Sensor],ct_01[Zone Application Type]=ZoneTypes!G29,\"\")))","v":"ClimateSync Room Sensor"}]
[{"$f":"TRANSPOSE(_xlfn.UNIQUE(_xlfn._xlws.FILTER(ct_01[Zone Temp Sensor],ct_01[Zone Application Type]=ZoneTypes!G30,\"\")))","v":"ClimateSync Room Sensor"}]
[{"$f":"TRANSPOSE(_xlfn.UNIQUE(_xlfn._xlws.FILTER(ct_01[Zone Temp Sensor],ct_01[Zone Application Type]=ZoneTypes!G31,\"\")))","v":"ClimateSync Room Sensor"}]
[{"$f":"TRANSPOSE(_xlfn.UNIQUE(_xlfn._xlws.FILTER(ct_01[Zone Temp Sensor],ct_01[Zone Application Type]=ZoneTypes!G32,\"\")))","v":"ClimateSync Room Sensor"}]
[{"$f":"TRANSPOSE(_xlfn.UNIQUE(_xlfn._xlws.FILTER(ct_01[Zone Temp Sensor],ct_01[Zone Application Type]=ZoneTypes!G33,\"\")))","v":"ClimateSync Room Sensor"}]
[{"$f":"TRANSPOSE(_xlfn.UNIQUE(_xlfn._xlws.FILTER(ct_01[Zone Temp Sensor],ct_01[Zone Application Type]=ZoneTypes!G34,\"\")))","v":""}]
[{"$f":"TRANSPOSE(_xlfn.UNIQUE(_xlfn._xlws.FILTER(ct_01[Zone Temp Sensor],ct_01[Zone Application Type]=ZoneTypes!G35,\"\")))","v":"First Select Zone Application Type"}]
[{"$f":"TRANSPOSE(_xlfn.UNIQUE(_xlfn._xlws.FILTER(ct_01[Zone Temp Sensor],ct_01[Zone Application Type]=ZoneTypes!G36,\"\")))","v":"First Select Zone Application Type"}]
[{"$f":"TRANSPOSE(_xlfn.UNIQUE(_xlfn._xlws.FILTER(ct_01[Zone Temp Sensor],ct_01[Zone Application Type]=ZoneTypes!G37,\"\")))","v":"First Select Zone Application Type"}]
[{"$f":"TRANSPOSE(_xlfn.UNIQUE(_xlfn._xlws.FILTER(ct_01[Zone Temp Sensor],ct_01[Zone Application Type]=ZoneTypes!G38,\"\")))","v":"First Select Zone Application Type"}]
[{"$f":"TRANSPOSE(_xlfn.UNIQUE(_xlfn._xlws.FILTER(ct_01[Zone Temp Sensor],ct_01[Zone Application Type]=ZoneTypes!G39,\"\")))","v":"First Select Zone Application Type"}]
[{"$f":"TRANSPOSE(_xlfn.UNIQUE(_xlfn._xlws.FILTER(ct_01[Zone Temp Sensor],ct_01[Zone Application Type]=ZoneTypes!G40,\"\")))","v":"First Select Zone Application Type"}]
[{"$f":"TRANSPOSE(_xlfn.UNIQUE(_xlfn._xlws.FILTER(ct_01[Zone Temp Sensor],ct_01[Zone Application Type]=ZoneTypes!G41,\"\")))","v":"First Select Zone Application Type"}]
[{"$f":"TRANSPOSE(_xlfn.UNIQUE(_xlfn._xlws.FILTER(ct_01[Zone Temp Sensor],ct_01[Zone Application Type]=ZoneTypes!G42,\"\")))","v":"First Select Zone Application Type"}]
[{"$f":"TRANSPOSE(_xlfn.UNIQUE(_xlfn._xlws.FILTER(ct_01[Zone Temp Sensor],ct_01[Zone Application Type]=ZoneTypes!G43,\"\")))","v":"First Select Zone Application Type"}]
[{"$f":"TRANSPOSE(_xlfn.UNIQUE(_xlfn._xlws.FILTER(ct_01[Zone Temp Sensor],ct_01[Zone Application Type]=ZoneTypes!G44,\"\")))","v":"First Select Zone Application Type"}]
[{"$f":"TRANSPOSE(_xlfn.UNIQUE(_xlfn._xlws.FILTER(ct_01[Zone Temp Sensor],ct_01[Zone Application Type]=ZoneTypes!G45,\"\")))","v":"First Select Zone Application Type"}]
[{"$f":"TRANSPOSE(_xlfn.UNIQUE(_xlfn._xlws.FILTER(ct_01[Zone Temp Sensor],ct_01[Zone Application Type]=ZoneTypes!G46,\"\")))","v":"First Select Zone Application Type"}]
[{"$f":"TRANSPOSE(_xlfn.UNIQUE(_xlfn._xlws.FILTER(ct_01[Zone Temp Sensor],ct_01[Zone Application Type]=ZoneTypes!G47,\"\")))","v":"First Select Zone Application Type"}]
[{"$f":"TRANSPOSE(_xlfn.UNIQUE(_xlfn._xlws.FILTER(ct_01[Zone Temp Sensor],ct_01[Zone Application Type]=ZoneTypes!G48,\"\")))","v":"First Select Zone Application Type"}]
[{"$f":"TRANSPOSE(_xlfn.UNIQUE(_xlfn._xlws.FILTER(ct_01[Zone Temp Sensor],ct_01[Zone Application Type]=ZoneTypes!G49,\"\")))","v":"First Select Zone Application Type"}]
[{"$f":"TRANSPOSE(_xlfn.UNIQUE(_xlfn._xlws.FILTER(ct_01[Zone Temp Sensor],ct_01[Zone Application Type]=ZoneTypes!G50,\"\")))","v":"First Select Zone Application Type"}]
[{"$f":"TRANSPOSE(_xlfn.UNIQUE(_xlfn._xlws.FILTER(ct_01[Zone Temp Sensor],ct_01[Zone Application Type]=ZoneTypes!G51,\"\")))","v":"First Select Zone Application Type"}]
[{"$f":"TRANSPOSE(_xlfn.UNIQUE(_xlfn._xlws.FILTER(ct_01[Zone Temp Sensor],ct_01[Zone Application Type]=ZoneTypes!G52,\"\")))","v":"First Select Zone Application Type"}]
[{"$f":"TRANSPOSE(_xlfn.UNIQUE(_xlfn._xlws.FILTER(ct_01[Zone Temp Sensor],ct_01[Zone Application Type]=ZoneTypes!G53,\"\")))","v":"First Select Zone Application Type"}]
[{"$f":"TRANSPOSE(_xlfn.UNIQUE(_xlfn._xlws.FILTER(ct_01[Zone Temp Sensor],ct_01[Zone Application Type]=ZoneTypes!G54,\"\")))","v":"First Select Zone Application Type"}]
[{"$f":"TRANSPOSE(_xlfn.UNIQUE(_xlfn._xlws.FILTER(ct_01[Zone Temp Sensor],ct_01[Zone Application Type]=ZoneTypes!G55,\"\")))","v":"First Select Zone Application Type"}]
[{"$f":"TRANSPOSE(_xlfn.UNIQUE(_xlfn._xlws.FILTER(ct_01[Zone Temp Sensor],ct_01[Zone Application Type]=ZoneTypes!G56,\"\")))","v":"First Select Zone Application Type"}]
[{"$f":"TRANSPOSE(_xlfn.UNIQUE(_xlfn._xlws.FILTER(ct_01[Zone Temp Sensor],ct_01[Zone Application Type]=ZoneTypes!G57,\"\")))","v":"First Select Zone Application Type"}]
[{"$f":"TRANSPOSE(_xlfn.UNIQUE(_xlfn._xlws.FILTER(ct_01[Zone Temp Sensor],ct_01[Zone Application Type]=ZoneTypes!G58,\"\")))","v":"First Select Zone Application Type"}]
[{"$f":"TRANSPOSE(_xlfn.UNIQUE(_xlfn._xlws.FILTER(ct_01[Zone Temp Sensor],ct_01[Zone Application Type]=ZoneTypes!G59,\"\")))","v":"First Select Zone Application Type"}]
[{"$f":"TRANSPOSE(_xlfn.UNIQUE(_xlfn._xlws.FILTER(ct_01[Zone Temp Sensor],ct_01[Zone Application Type]=ZoneTypes!G60,\"\")))","v":"First Select Zone Application Type"}]
[{"$f":"TRANSPOSE(_xlfn.UNIQUE(_xlfn._xlws.FILTER(ct_01[Zone Temp Sensor],ct_01[Zone Application Type]=ZoneTypes!G61,\"\")))","v":"First Select Zone Application Type"}]
[{"$f":"TRANSPOSE(_xlfn.UNIQUE(_xlfn._xlws.FILTER(ct_01[Zone Temp Sensor],ct_01[Zone Application Type]=ZoneTypes!G62,\"\")))","v":"First Select Zone Application Type"}]
[{"$f":"TRANSPOSE(_xlfn.UNIQUE(_xlfn._xlws.FILTER(ct_01[Zone Temp Sensor],ct_01[Zone Application Type]=ZoneTypes!G63,\"\")))","v":"First Select Zone Application Type"}]
[{"$f":"TRANSPOSE(_xlfn.UNIQUE(_xlfn._xlws.FILTER(ct_01[Zone Temp Sensor],ct_01[Zone Application Type]=ZoneTypes!G64,\"\")))","v":"First Select Zone Application Type"}]
[{"$f":"TRANSPOSE(_xlfn.UNIQUE(_xlfn._xlws.FILTER(ct_01[Zone Temp Sensor],ct_01[Zone Application Type]=ZoneTypes!G65,\"\")))","v":"First Select Zone Application Type"}]
[{"$f":"TRANSPOSE(_xlfn.UNIQUE(_xlfn._xlws.FILTER(ct_01[Zone Temp Sensor],ct_01[Zone Application Type]=ZoneTypes!G66,\"\")))","v":"First Select Zone Application Type"}]
[{"$f":"TRANSPOSE(_xlfn.UNIQUE(_xlfn._xlws.FILTER(ct_01[Zone Temp Sensor],ct_01[Zone Application Type]=ZoneTypes!G67,\"\")))","v":"First Select Zone Application Type"}]
[{"$f":"TRANSPOSE(_xlfn.UNIQUE(_xlfn._xlws.FILTER(ct_01[Zone Temp Sensor],ct_01[Zone Application Type]=ZoneTypes!G68,\"\")))","v":"First Select Zone Application Type"}]
[{"$f":"TRANSPOSE(_xlfn.UNIQUE(_xlfn._xlws.FILTER(ct_01[Zone Temp Sensor],ct_01[Zone Application Type]=ZoneTypes!G69,\"\")))","v":"First Select Zone Application Type"}]
[{"$f":"TRANSPOSE(_xlfn.UNIQUE(_xlfn._xlws.FILTER(ct_01[Zone Temp Sensor],ct_01[Zone Application Type]=ZoneTypes!G70,\"\")))","v":"First Select Zone Application Type"}]
[{"$f":"TRANSPOSE(_xlfn.UNIQUE(_xlfn._xlws.FILTER(ct_01[Zone Temp Sensor],ct_01[Zone Application Type]=ZoneTypes!G71,\"\")))","v":"First Select Zone Application Type"}]
[{"$f":"TRANSPOSE(_xlfn.UNIQUE(_xlfn._xlws.FILTER(ct_01[Zone Temp Sensor],ct_01[Zone Application Type]=ZoneTypes!G72,\"\")))","v":"First Select Zone Application Type"}]
[{"$f":"TRANSPOSE(_xlfn.UNIQUE(_xlfn._xlws.FILTER(ct_01[Zone Temp Sensor],ct_01[Zone Application Type]=ZoneTypes!G73,\"\")))","v":"First Select Zone Application Type"}]
[{"$f":"TRANSPOSE(_xlfn.UNIQUE(_xlfn._xlws.FILTER(ct_01[Zone Temp Sensor],ct_01[Zone Application Type]=ZoneTypes!G74,\"\")))","v":"First Select Zone Application Type"}]
[{"$f":"TRANSPOSE(_xlfn.UNIQUE(_xlfn._xlws.FILTER(ct_01[Zone Temp Sensor],ct_01[Zone Application Type]=ZoneTypes!G75,\"\")))","v":"First Select Zone Application Type"}]
[{"$f":"TRANSPOSE(_xlfn.UNIQUE(_xlfn._xlws.FILTER(ct_01[Zone Temp Sensor],ct_01[Zone Application Type]=ZoneTypes!G76,\"\")))","v":"First Select Zone Application Type"}]
[{"$f":"TRANSPOSE(_xlfn.UNIQUE(_xlfn._xlws.FILTER(ct_01[Zone Temp Sensor],ct_01[Zone Application Type]=ZoneTypes!G77,\"\")))","v":"First Select Zone Application Type"}]
[{"$f":"TRANSPOSE(_xlfn.UNIQUE(_xlfn._xlws.FILTER(ct_01[Zone Temp Sensor],ct_01[Zone Application Type]=ZoneTypes!G78,\"\")))","v":"First Select Zone Application Type"}]
[{"$f":"TRANSPOSE(_xlfn.UNIQUE(_xlfn._xlws.FILTER(ct_01[Zone Temp Sensor],ct_01[Zone Application Type]=ZoneTypes!G79,\"\")))","v":"First Select Zone Application Type"}]
[{"$f":"TRANSPOSE(_xlfn.UNIQUE(_xlfn._xlws.FILTER(ct_01[Zone Temp Sensor],ct_01[Zone Application Type]=ZoneTypes!G80,\"\")))","v":"First Select Zone Application Type"}]
[{"$f":"TRANSPOSE(_xlfn.UNIQUE(_xlfn._xlws.FILTER(ct_01[Zone Temp Sensor],ct_01[Zone Application Type]=ZoneTypes!G81,\"\")))","v":"First Select Zone Application Type"}]
[{"$f":"TRANSPOSE(_xlfn.UNIQUE(_xlfn._xlws.FILTER(ct_01[Zone Temp Sensor],ct_01[Zone Application Type]=ZoneTypes!G82,\"\")))","v":"First Select Zone Application Type"}]
[{"$f":"TRANSPOSE(_xlfn.UNIQUE(_xlfn._xlws.FILTER(ct_01[Zone Temp Sensor],ct_01[Zone Application Type]=ZoneTypes!G83,\"\")))","v":"First Select Zone Application Type"}]
[{"$f":"TRANSPOSE(_xlfn.UNIQUE(_xlfn._xlws.FILTER(ct_01[Zone Temp Sensor],ct_01[Zone Application Type]=ZoneTypes!G84,\"\")))","v":"First Select Zone Application Type"}]
[{"$f":"TRANSPOSE(_xlfn.UNIQUE(_xlfn._xlws.FILTER(ct_01[Zone Temp Sensor],ct_01[Zone Application Type]=ZoneTypes!G85,\"\")))","v":"First Select Zone Application Type"}]
[{"$f":"TRANSPOSE(_xlfn.UNIQUE(_xlfn._xlws.FILTER(ct_01[Zone Temp Sensor],ct_01[Zone Application Type]=ZoneTypes!G86,\"\")))","v":"First Select Zone Application Type"}]
[{"$f":"TRANSPOSE(_xlfn.UNIQUE(_xlfn._xlws.FILTER(ct_01[Zone Temp Sensor],ct_01[Zone Application Type]=ZoneTypes!G87,\"\")))","v":"First Select Zone Application Type"}]
[{"$f":"TRANSPOSE(_xlfn.UNIQUE(_xlfn._xlws.FILTER(ct_01[Zone Temp Sensor],ct_01[Zone Application Type]=ZoneTypes!G88,\"\")))","v":"First Select Zone Application Type"}]
[{"$f":"TRANSPOSE(_xlfn.UNIQUE(_xlfn._xlws.FILTER(ct_01[Zone Temp Sensor],ct_01[Zone Application Type]=ZoneTypes!G89,\"\")))","v":"First Select Zone Application Type"}]
[{"$f":"TRANSPOSE(_xlfn.UNIQUE(_xlfn._xlws.FILTER(ct_01[Zone Temp Sensor],ct_01[Zone Application Type]=ZoneTypes!G90,\"\")))","v":"First Select Zone Application Type"}]
[{"$f":"TRANSPOSE(_xlfn.UNIQUE(_xlfn._xlws.FILTER(ct_01[Zone Temp Sensor],ct_01[Zone Application Type]=ZoneTypes!G91,\"\")))","v":"First Select Zone Application Type"}]
[{"$f":"TRANSPOSE(_xlfn.UNIQUE(_xlfn._xlws.FILTER(ct_01[Zone Temp Sensor],ct_01[Zone Application Type]=ZoneTypes!G92,\"\")))","v":"First Select Zone Application Type"}]
[{"$f":"TRANSPOSE(_xlfn.UNIQUE(_xlfn._xlws.FILTER(ct_01[Zone Temp Sensor],ct_01[Zone Application Type]=ZoneTypes!G93,\"\")))","v":"First Select Zone Application Type"}]
[{"$f":"TRANSPOSE(_xlfn.UNIQUE(_xlfn._xlws.FILTER(ct_01[Zone Temp Sensor],ct_01[Zone Application Type]=ZoneTypes!G94,\"\")))","v":"First Select Zone Application Type"}]
[{"$f":"TRANSPOSE(_xlfn.UNIQUE(_xlfn._xlws.FILTER(ct_01[Zone Temp Sensor],ct_01[Zone Application Type]=ZoneTypes!G95,\"\")))","v":"First Select Zone Application Type"}]
[{"$f":"TRANSPOSE(_xlfn.UNIQUE(_xlfn._xlws.FILTER(ct_01[Zone Temp Sensor],ct_01[Zone Application Type]=ZoneTypes!G96,\"\")))","v":"First Select Zone Application Type"}]
[{"$f":"TRANSPOSE(_xlfn.UNIQUE(_xlfn._xlws.FILTER(ct_01[Zone Temp Sensor],ct_01[Zone Application Type]=ZoneTypes!G97,\"\")))","v":"First Select Zone Application Type"}]
[{"$f":"TRANSPOSE(_xlfn.UNIQUE(_xlfn._xlws.FILTER(ct_01[Zone Temp Sensor],ct_01[Zone Application Type]=ZoneTypes!G98,\"\")))","v":"First Select Zone Application Type"}]
[{"$f":"TRANSPOSE(_xlfn.UNIQUE(_xlfn._xlws.FILTER(ct_01[Zone Temp Sensor],ct_01[Zone Application Type]=ZoneTypes!G99,\"\")))","v":"First Select Zone Application Type"}]
[{"$f":"TRANSPOSE(_xlfn.UNIQUE(_xlfn._xlws.FILTER(ct_01[Zone Temp Sensor],ct_01[Zone Application Type]=ZoneTypes!G100,\"\")))","v":"First Select Zone Application Type"}]
[{"$f":"TRANSPOSE(_xlfn.UNIQUE(_xlfn._xlws.FILTER(ct_01[Zone Temp Sensor],ct_01[Zone Application Type]=ZoneTypes!G101,\"\")))","v":"First Select Zone Application Type"}]
[{"$f":"TRANSPOSE(_xlfn.UNIQUE(_xlfn._xlws.FILTER(ct_01[Zone Temp Sensor],ct_01[Zone Application Type]=ZoneTypes!G102,\"\")))","v":"First Select Zone Application Type"}]
[{"$f":"TRANSPOSE(_xlfn.UNIQUE(_xlfn._xlws.FILTER(ct_01[Zone Temp Sensor],ct_01[Zone Application Type]=ZoneTypes!G103,\"\")))","v":"First Select Zone Application Type"}]
[{"$f":"TRANSPOSE(_xlfn.UNIQUE(_xlfn._xlws.FILTER(ct_01[Zone Temp Sensor],ct_01[Zone Application Type]=ZoneTypes!G104,\"\")))","v":"First Select Zone Application Type"}]
[{"$f":"TRANSPOSE(_xlfn.UNIQUE(_xlfn._xlws.FILTER(ct_01[Zone Temp Sensor],ct_01[Zone Application Type]=ZoneTypes!G105,\"\")))","v":"First Select Zone Application Type"}]
[{"$f":"TRANSPOSE(_xlfn.UNIQUE(_xlfn._xlws.FILTER(ct_01[Zone Temp Sensor],ct_01[Zone Application Type]=ZoneTypes!G106,\"\")))","v":"First Select Zone Application Type"}]
[{"$f":"TRANSPOSE(_xlfn.UNIQUE(_xlfn._xlws.FILTER(ct_01[Zone Temp Sensor],ct_01[Zone Application Type]=ZoneTypes!G107,\"\")))","v":"First Select Zone Application Type"}]
[{"$f":"TRANSPOSE(_xlfn.UNIQUE(_xlfn._xlws.FILTER(ct_01[Zone Temp Sensor],ct_01[Zone Application Type]=ZoneTypes!G108,\"\")))","v":"First Select Zone Application Type"}]
[{"$f":"TRANSPOSE(_xlfn.UNIQUE(_xlfn._xlws.FILTER(ct_01[Zone Temp Sensor],ct_01[Zone Application Type]=ZoneTypes!G109,\"\")))","v":"First Select Zone Application Type"}]
[{"$f":"TRANSPOSE(_xlfn.UNIQUE(_xlfn._xlws.FILTER(ct_01[Zone Temp Sensor],ct_01[Zone Application Type]=ZoneTypes!G110,\"\")))","v":"First Select Zone Application Type"}]
[{"$f":"TRANSPOSE(_xlfn.UNIQUE(_xlfn._xlws.FILTER(ct_01[Zone Temp Sensor],ct_01[Zone Application Type]=ZoneTypes!G111,\"\")))","v":"First Select Zone Application Type"}]
[{"$f":"TRANSPOSE(_xlfn.UNIQUE(_xlfn._xlws.FILTER(ct_01[Zone Temp Sensor],ct_01[Zone Application Type]=ZoneTypes!G112,\"\")))","v":"First Select Zone Application Type"}]
[{"$f":"TRANSPOSE(_xlfn.UNIQUE(_xlfn._xlws.FILTER(ct_01[Zone Temp Sensor],ct_01[Zone Application Type]=ZoneTypes!G113,\"\")))","v":"First Select Zone Application Type"}]
[{"$f":"TRANSPOSE(_xlfn.UNIQUE(_xlfn._xlws.FILTER(ct_01[Zone Temp Sensor],ct_01[Zone Application Type]=ZoneTypes!G114,\"\")))","v":"First Select Zone Application Type"}]
[{"$f":"TRANSPOSE(_xlfn.UNIQUE(_xlfn._xlws.FILTER(ct_01[Zone Temp Sensor],ct_01[Zone Application Type]=ZoneTypes!G115,\"\")))","v":"First Select Zone Application Type"}]
[{"$f":"TRANSPOSE(_xlfn.UNIQUE(_xlfn._xlws.FILTER(ct_01[Zone Temp Sensor],ct_01[Zone Application Type]=ZoneTypes!G116,\"\")))","v":"First Select Zone Application Type"}]
[{"$f":"TRANSPOSE(_xlfn.UNIQUE(_xlfn._xlws.FILTER(ct_01[Zone Temp Sensor],ct_01[Zone Application Type]=ZoneTypes!G117,\"\")))","v":"First Select Zone Application Type"}]
[{"$f":"TRANSPOSE(_xlfn.UNIQUE(_xlfn._xlws.FILTER(ct_01[Zone Temp Sensor],ct_01[Zone Application Type]=ZoneTypes!G118,\"\")))","v":"First Select Zone Application Type"}]
[{"$f":"TRANSPOSE(_xlfn.UNIQUE(_xlfn._xlws.FILTER(ct_01[Zone Temp Sensor],ct_01[Zone Application Type]=ZoneTypes!G119,\"\")))","v":"First Select Zone Application Type"}]
[{"$f":"TRANSPOSE(_xlfn.UNIQUE(_xlfn._xlws.FILTER(ct_01[Zone Temp Sensor],ct_01[Zone Application Type]=ZoneTypes!G120,\"\")))","v":"First Select Zone Application Type"}]
[{"$f":"TRANSPOSE(_xlfn.UNIQUE(_xlfn._xlws.FILTER(ct_01[Zone Temp Sensor],ct_01[Zone Application Type]=ZoneTypes!G121,\"\")))","v":"First Select Zone Application Type"}]
[{"$f":"TRANSPOSE(_xlfn.UNIQUE(_xlfn._xlws.FILTER(ct_01[Zone Temp Sensor],ct_01[Zone Application Type]=ZoneTypes!G122,\"\")))","v":"First Select Zone Application Type"}]
[{"$f":"TRANSPOSE(_xlfn.UNIQUE(_xlfn._xlws.FILTER(ct_01[Zone Temp Sensor],ct_01[Zone Application Type]=ZoneTypes!G123,\"\")))","v":"First Select Zone Application Type"}]
[{"$f":"TRANSPOSE(_xlfn.UNIQUE(_xlfn._xlws.FILTER(ct_01[Zone Temp Sensor],ct_01[Zone Application Type]=ZoneTypes!G124,\"\")))","v":"First Select Zone Application Type"}]
[{"$f":"TRANSPOSE(_xlfn.UNIQUE(_xlfn._xlws.FILTER(ct_01[Zone Temp Sensor],ct_01[Zone Application Type]=ZoneTypes!G125,\"\")))","v":"First Select Zone Application Type"}]
[{"$f":"TRANSPOSE(_xlfn.UNIQUE(_xlfn._xlws.FILTER(ct_01[Zone Temp Sensor],ct_01[Zone Application Type]=ZoneTypes!G126,\"\")))","v":"First Select Zone Application Type"}]
[{"$f":"TRANSPOSE(_xlfn.UNIQUE(_xlfn._xlws.FILTER(ct_01[Zone Temp Sensor],ct_01[Zone Application Type]=ZoneTypes!G127,\"\")))","v":"First Select Zone Application Type"}]
[{"$f":"TRANSPOSE(_xlfn.UNIQUE(_xlfn._xlws.FILTER(ct_01[Zone Temp Sensor],ct_01[Zone Application Type]=ZoneTypes!G128,\"\")))","v":"First Select Zone Application Type"}]
[{"$f":"TRANSPOSE(_xlfn.UNIQUE(_xlfn._xlws.FILTER(ct_01[Zone Temp Sensor],ct_01[Zone Application Type]=ZoneTypes!G129,\"\")))","v":"First Select Zone Application Type"}]
[{"$f":"TRANSPOSE(_xlfn.UNIQUE(_xlfn._xlws.FILTER(ct_01[Zone Temp Sensor],ct_01[Zone Application Type]=ZoneTypes!G130,\"\")))","v":"First Select Zone Application Type"}]
[{"$f":"TRANSPOSE(_xlfn.UNIQUE(_xlfn._xlws.FILTER(ct_01[Zone Temp Sensor],ct_01[Zone Application Type]=ZoneTypes!G131,\"\")))","v":"First Select Zone Application Type"}]
[{"$f":"TRANSPOSE(_xlfn.UNIQUE(_xlfn._xlws.FILTER(ct_01[Zone Temp Sensor],ct_01[Zone Application Type]=ZoneTypes!G132,\"\")))","v":"First Select Zone Application Type"}]
[{"$f":"TRANSPOSE(_xlfn.UNIQUE(_xlfn._xlws.FILTER(ct_01[Zone Temp Sensor],ct_01[Zone Application Type]=ZoneTypes!G133,\"\")))","v":"First Select Zone Application Type"}]
[{"$f":"TRANSPOSE(_xlfn.UNIQUE(_xlfn._xlws.FILTER(ct_01[Zone Temp Sensor],ct_01[Zone Application Type]=ZoneTypes!G134,\"\")))","v":"First Select Zone Application Type"}]
[{"$f":"TRANSPOSE(_xlfn.UNIQUE(_xlfn._xlws.FILTER(ct_01[Zone Temp Sensor],ct_01[Zone Application Type]=ZoneTypes!G135,\"\")))","v":"First Select Zone Application Type"}]
[{"$f":"TRANSPOSE(_xlfn.UNIQUE(_xlfn._xlws.FILTER(ct_01[Zone Temp Sensor],ct_01[Zone Application Type]=ZoneTypes!G136,\"\")))","v":"First Select Zone Application Type"}]
[{"$f":"TRANSPOSE(_xlfn.UNIQUE(_xlfn._xlws.FILTER(ct_01[Zone Temp Sensor],ct_01[Zone Application Type]=ZoneTypes!G137,\"\")))","v":"First Select Zone Application Type"}]
[{"$f":"TRANSPOSE(_xlfn.UNIQUE(_xlfn._xlws.FILTER(ct_01[Zone Temp Sensor],ct_01[Zone Application Type]=ZoneTypes!G138,\"\")))","v":"First Select Zone Application Type"}]
[{"$f":"TRANSPOSE(_xlfn.UNIQUE(_xlfn._xlws.FILTER(ct_01[Zone Temp Sensor],ct_01[Zone Application Type]=ZoneTypes!G139,\"\")))","v":"First Select Zone Application Type"}]
[{"$f":"TRANSPOSE(_xlfn.UNIQUE(_xlfn._xlws.FILTER(ct_01[Zone Temp Sensor],ct_01[Zone Application Type]=ZoneTypes!G140,\"\")))","v":"First Select Zone Application Type"}]
[{"$f":"TRANSPOSE(_xlfn.UNIQUE(_xlfn._xlws.FILTER(ct_01[Zone Temp Sensor],ct_01[Zone Application Type]=ZoneTypes!G141,\"\")))","v":"First Select Zone Application Type"}]
[{"$f":"TRANSPOSE(_xlfn.UNIQUE(_xlfn._xlws.FILTER(ct_01[Zone Temp Sensor],ct_01[Zone Application Type]=ZoneTypes!G142,\"\")))","v":"First Select Zone Application Type"}]
[{"$f":"TRANSPOSE(_xlfn.UNIQUE(_xlfn._xlws.FILTER(ct_01[Zone Temp Sensor],ct_01[Zone Application Type]=ZoneTypes!G143,\"\")))","v":"First Select Zone Application Type"}]
[{"$f":"TRANSPOSE(_xlfn.UNIQUE(_xlfn._xlws.FILTER(ct_01[Zone Temp Sensor],ct_01[Zone Application Type]=ZoneTypes!G144,\"\")))","v":"First Select Zone Application Type"}]
[{"$f":"TRANSPOSE(_xlfn.UNIQUE(_xlfn._xlws.FILTER(ct_01[Zone Temp Sensor],ct_01[Zone Application Type]=ZoneTypes!G145,\"\")))","v":"First Select Zone Application Type"}]
[{"$f":"TRANSPOSE(_xlfn.UNIQUE(_xlfn._xlws.FILTER(ct_01[Zone Temp Sensor],ct_01[Zone Application Type]=ZoneTypes!G146,\"\")))","v":"First Select Zone Application Type"}]
[{"$f":"TRANSPOSE(_xlfn.UNIQUE(_xlfn._xlws.FILTER(ct_01[Zone Temp Sensor],ct_01[Zone Application Type]=ZoneTypes!G147,\"\")))","v":"First Select Zone Application Type"}]
[{"$f":"TRANSPOSE(_xlfn.UNIQUE(_xlfn._xlws.FILTER(ct_01[Zone Temp Sensor],ct_01[Zone Application Type]=ZoneTypes!G148,\"\")))","v":"First Select Zone Application Type"}]
[{"$f":"TRANSPOSE(_xlfn.UNIQUE(_xlfn._xlws.FILTER(ct_01[Zone Temp Sensor],ct_01[Zone Application Type]=ZoneTypes!G149,\"\")))","v":"First Select Zone Application Type"}]
[{"$f":"TRANSPOSE(_xlfn.UNIQUE(_xlfn._xlws.FILTER(ct_01[Zone Temp Sensor],ct_01[Zone Application Type]=ZoneTypes!G150,\"\")))","v":"First Select Zone Application Type"}]
[{"$f":"TRANSPOSE(_xlfn.UNIQUE(_xlfn._xlws.FILTER(ct_01[Zone Temp Sensor],ct_01[Zone Application Type]=ZoneTypes!G151,\"\")))","v":"First Select Zone Application Type"}]
[{"$f":"TRANSPOSE(_xlfn.UNIQUE(_xlfn._xlws.FILTER(ct_01[Zone Temp Sensor],ct_01[Zone Application Type]=ZoneTypes!G152,\"\")))","v":"First Select Zone Application Type"}]
[{"$f":"TRANSPOSE(_xlfn.UNIQUE(_xlfn._xlws.FILTER(ct_01[Zone Temp Sensor],ct_01[Zone Application Type]=ZoneTypes!G153,\"\")))","v":"First Select Zone Application Type"}]
[{"$f":"TRANSPOSE(_xlfn.UNIQUE(_xlfn._xlws.FILTER(ct_01[Zone Temp Sensor],ct_01[Zone Application Type]=ZoneTypes!G154,\"\")))","v":"First Select Zone Application Type"}]
[{"$f":"TRANSPOSE(_xlfn.UNIQUE(_xlfn._xlws.FILTER(ct_01[Zone Temp Sensor],ct_01[Zone Application Type]=ZoneTypes!G155,\"\")))","v":"First Select Zone Application Type"}]
[{"$f":"TRANSPOSE(_xlfn.UNIQUE(_xlfn._xlws.FILTER(ct_01[Zone Temp Sensor],ct_01[Zone Application Type]=ZoneTypes!G156,\"\")))","v":"First Select Zone Application Type"}]
[{"$error":"#REF!"}]
[{"$error":"#REF!"}]
[{"$error":"#REF!"}]
[{"$error":"#REF!"}]
[{"$error":"#REF!"}]
[{"$error":"#REF!"}]
[{"$error":"#REF!"}]
[{"$error":"#REF!"}]
[{"$error":"#REF!"}]
[{"$error":"#REF!"}]
[{"$error":"#REF!"}]
[{"$error":"#REF!"}]
[{"$error":"#REF!"}]
[{"$error":"#REF!"}]
[{"$error":"#REF!"}]
[{"$error":"#REF!"}]
[{"$error":"#REF!"}]
[{"$error":"#REF!"}]
[{"$error":"#REF!"}]
[{"$error":"#REF!"}]
[{"$error":"#REF!"}]
[{"$error":"#REF!"}]
[{"$error":"#REF!"}]
[{"$error":"#REF!"}]
[{"$error":"#REF!"}]
[{"$error":"#REF!"}]
[{"$error":"#REF!"}]
[{"$error":"#REF!"}]
[{"$error":"#REF!"}]
[{"$error":"#REF!"}]
[{"$error":"#REF!"}]
[{"$error":"#REF!"}]
[{"$error":"#REF!"}]
[{"$error":"#REF!"}]
[{"$error":"#REF!"}]
[{"$error":"#REF!"}]
[{"$error":"#REF!"}]
[{"$error":"#REF!"}]
[{"$error":"#REF!"}]
[{"$error":"#REF!"}]
[{"$error":"#REF!"}]
[{"$error":"#REF!"}]
[{"$error":"#REF!"}]
[{"$error":"#REF!"}]
[{"$error":"#REF!"}]
[{"$error":"#REF!"}]
[{"$error":"#REF!"}]
[{"$error":"#REF!"}]
[{"$error":"#REF!"}]
[{"$error":"#REF!"}]
[{"$error":"#REF!"}]
[{"$error":"#REF!"}]
[{"$error":"#REF!"}]
[{"$error":"#REF!"}]
[{"$error":"#REF!"}]
[{"$error":"#REF!"}]
[{"$error":"#REF!"}]
[{"$error":"#REF!"}]
[{"$error":"#REF!"}]
[{"$error":"#REF!"}]
[{"$error":"#REF!"}]
[{"$error":"#REF!"}]
[{"$error":"#REF!"}]
[{"$error":"#REF!"}]
[{"$error":"#REF!"}]
[{"$error":"#REF!"}]
[{"$error":"#REF!"}]
[{"$error":"#REF!"}]
[{"$error":"#REF!"}]
[{"$error":"#REF!"}]
[{"$error":"#REF!"}]
[{"$error":"#REF!"}]
[{"$error":"#REF!"}]
[{"$error":"#REF!"}]
[{"$error":"#REF!"}]
[{"$error":"#REF!"}]
[{"$error":"#REF!"}]
[{"$error":"#REF!"}]
[{"$error":"#REF!"}]
[{"$error":"#REF!"}]
[{"$error":"#REF!"}]
[{"$error":"#REF!"}]
[{"$error":"#REF!"}]
[{"$error":"#REF!"}]
[{"$error":"#REF!"}]
[{"$error":"#REF!"}]
[{"$error":"#REF!"}]
[{"$error":"#REF!"}]
[{"$error":"#REF!"}]
[{"$error":"#REF!"}]
[{"$error":"#REF!"}]
[{"$error":"#REF!"}]
[{"$error":"#REF!"}]
[{"$error":"#REF!"}]
[{"$error":"#REF!"}]
[{"$error":"#REF!"}]
[{"$error":"#REF!"}]
[{"$error":"#REF!"}]
[{"$error":"#REF!"}]
[{"$error":"#REF!"}]
[{"$error":"#REF!"}]
[{"$error":"#REF!"}]
[{"$error":"#REF!"}]
[{"$error":"#REF!"}]
[{"$error":"#REF!"}]
[{"$error":"#REF!"}]
[{"$error":"#REF!"}]
[{"$error":"#REF!"}]
[{"$error":"#REF!"}]
[{"$error":"#REF!"}]
[{"$error":"#REF!"}]
[{"$error":"#REF!"}]
[{"$error":"#REF!"}]
[{"$error":"#REF!"}]
[{"$error":"#REF!"}]
[{"$error":"#REF!"}]
[{"$error":"#REF!"}]
[{"$error":"#REF!"}]
[{"$error":"#REF!"}]
[{"$error":"#REF!"}]
[{"$error":"#REF!"}]
[{"$error":"#REF!"}]
[{"$error":"#REF!"}]
[{"$error":"#REF!"}]
[{"$error":"#REF!"}]
[{"$error":"#REF!"}]
[{"$error":"#REF!"}]
[{"$error":"#REF!"}]
[{"$error":"#REF!"}]
[{"$error":"#REF!"}]
[{"$error":"#REF!"}]
[{"$error":"#REF!"}]
[{"$error":"#REF!"}]
[{"$error":"#REF!"}]
[{"$error":"#REF!"}]
[{"$error":"#REF!"}]
[{"$error":"#REF!"}]
[{"$error":"#REF!"}]
[{"$error":"#REF!"}]
[{"$error":"#REF!"}]
[{"$error":"#REF!"}]
[{"$error":"#REF!"}]
[{"$error":"#REF!"}]
[{"$error":"#REF!"}]
[{"$error":"#REF!"}]
[{"$error":"#REF!"}]
[{"$error":"#REF!"}]
[{"$error":"#REF!"}]
[{"$error":"#REF!"}]
[{"$error":"#REF!"}]
[{"$error":"#REF!"}]
[{"$error":"#REF!"}]
[{"$error":"#REF!"}]

{"sheet":"ZoneTypes","index":7,"n_rows":162,"n_cols":25,"rows_kept":162,"merged":[[0,20,0,24],[2,0,20,0],[33,0,33,24],[34,4,41,4],[42,4,49,4],[50,4,57,4],[58,4,65,4],[66,4,73,4],[74,4,81,4],[82,4,89,4],[90,4,97,4],[98,4,105,4],[106,4,113,4],[114,4,121,4],[122,4,129,4],[130,4,137,4],[138,4,145,4],[146,4,153,4],[154,4,161,4]]}
[{"$nulls":20},"Commissioning Section"]
["Plot","Floor","Room","UFH Manifold","CS","CH-8 Wiring Centre Zone ID","Zone Application Type","Zone Type","Air Con Brand","Air Con Model","FCU Reference","UFH Type","UFH Zone Reference","Floor Finish (Optional)"," Floor Temperature Protection Limit Required","Floor Temperature Limit °C","Temperature to be Controlled","Zone Temp Sensor","Wired Controller","Notes","ClimateSync Zone Address","CooLinkHub Virtual Zone Address","AC Central Address","CMN Line"," Address for Automation Zone Driver"]
["Examples of Application Combinations Available","Ground","Lounge","M1",null,"1-1","A",{"$f":"VLOOKUP($G3,CleanCombi!$A$1:$H$1826,2,0)","v":"Heating + Air Con"},"PLEASE SELECT",null,null,{"$f":"VLOOKUP($G3,CleanCombi!$A$1:$H$1826,4,0)","v":"WET UFH"},null,null,{"$f":"VLOOKUP($G3,CleanCombi!$A$1:$H$1826,5,0)","v":"NO"},"N/A",{"$f":"VLOOKUP($G3,CleanCombi!$A$1:$H$1826,7,0)","v":"Room Temp"},"PLEASE SELECT"]
[null,"1st","Master Bedroom","M2",null,"1-1","B",{"$f":"VLOOKUP($G4,CleanCombi!$A$1:$H$1826,2,0)","v":"Heating + Air Con"},"PLEASE SELECT",null,null,{"$f":"VLOOKUP($G4,CleanCombi!$A$1:$H$1826,4,0)","v":"WET UFH"},null,null,{"$f":"VLOOKUP($G4,CleanCombi!$A$1:$H$1826,5,0)","v":"YES"},"PLEASE SELECT",{"$f":"VLOOKUP($G4,CleanCombi!$A$1:$H$1826,7,0)","v":"Room Temp"},"PLEASE SELECT"]
[null,"1st","Master EnSuite","M3",null,"1-1","C",{"$f":"VLOOKUP($G5,CleanCombi!$A$1:$H$1826,2,0)","v":"Heating + Air Con"},"PLEASE SELECT",null,null,{"$f":"VLOOKUP($G5,CleanCombi!$A$1:$H$1826,4,0)","v":"ELECTRIC UFH"},null,null,{"$f":"VLOOKUP($G5,CleanCombi!$A$1:$H$1826,5,0)","v":"NO"},"N/A",{"$f":"VLOOKUP($G5,CleanCombi!$A$1:$H$1826,7,0)","v":"Room Temp"},"PLEASE SELECT"]
[{"$nulls":6},"D",{"$f":"VLOOKUP($G6,CleanCombi!$A$1:$H$1826,2,0)","v":"Heating + Air Con"},"PLEASE SELECT",null,null,{"$f":"VLOOKUP($G6,CleanCombi!$A$1:$H$1826,4,0)","v":"ELECTRIC UFH"},null,null,{"$f":"VLOOKUP($G6,CleanCombi!$A$1:$H$1826,5,0)","v":"YES"},"PLEASE SELECT",{"$f":"VLOOKUP($G6,CleanCombi!$A$1:$H$1826,7,0)","v":"Room Temp"},"PLEASE SELECT"]
[{"$nulls":6},"E",{"$f":"VLOOKUP($G7,CleanCombi!$A$1:$H$1826,2,0)","v":"Heating + Air Con"},"PLEASE SELECT",null,null,{"$f":"VLOOKUP($G7,CleanCombi!$A$1:$H$1826,4,0)","v":"RADIATOR"},null,null,{"$f":"VLOOKUP($G7,CleanCombi!$A$1:$H$1826,5,0)","v":"N/A"},"N/A",{"$f":"VLOOKUP($G7,CleanCombi!$A$1:$H$1826,7,0)","v":"Room Temp"},"PLEASE SELECT"]
[{"$nulls":6},"F",{"$f":"VLOOKUP($G8,CleanCombi!$A$1:$H$1826,2,0)","v":"AC only"},"PLEASE SELECT",null,null,{"$f":"VLOOKUP($G8,CleanCombi!$A$1:$H$1826,4,0)","v":"N/A"},null,null,{"$f":"VLOOKUP($G8,CleanCombi!$A$1:$H$1826,5,0)","v":"N/A"},"N/A",{"$f":"VLOOKUP($G8,CleanCombi!$A$1:$H$1826,7,0)","v":"Room Temp"},"PLEASE SELECT"]
[{"$nulls":6},"G",{"$f":"VLOOKUP($G9,CleanCombi!$A$1:$H$1826,2,0)","v":"Heating"},"N/A",null,null,{"$f":"VLOOKUP($G9,CleanCombi!$A$1:$H$1826,4,0)","v":"WET UFH"},null,null,{"$f":"VLOOKUP($G9,CleanCombi!$A$1:$H$1826,5,0)","v":"NO"},"N/A",{"$f":"VLOOKUP($G9,CleanCombi!$A$1:$H$1826,7,0)","v":"Room Temp"},"PLEASE SELECT"]
[{"$nulls":6},"H",{"$f":"VLOOKUP($G10,CleanCombi!$A$1:$H$1826,2,0)","v":"Heating"},"N/A",null,null,{"$f":"VLOOKUP($G10,CleanCombi!$A$1:$H$1826,4,0)","v":"WET UFH"},null,null,{"$f":"VLOOKUP($G10,CleanCombi!$A$1:$H$1826,5,0)","v":"YES"},"PLEASE SELECT",{"$f":"VLOOKUP($G10,CleanCombi!$A$1:$H$1826,7,0)","v":"Room Temp"},"PLEASE SELECT"]
[{"$nulls":6},"I",{"$f":"VLOOKUP($G11,CleanCombi!$A$1:$H$1826,2,0)","v":"Heating"},"N/A",null,null,{"$f":"VLOOKUP($G11,CleanCombi!$A$1:$H$1826,4,0)","v":"WET UFH"},null,null,{"$f":"VLOOKUP($G11,CleanCombi!$A$1:$H$1826,5,0)","v":"NO"},"N/A",{"$f":"VLOOKUP($G11,CleanCombi!$A$1:$H$1826,7,0)","v":"Floor Temp"},"Floor Probe"]
[{"$nulls":6},"J",{"$f":"VLOOKUP($G12,CleanCombi!$A$1:$H$1826,2,0)","v":"Heating"},"N/A",null,null,{"$f":"VLOOKUP($G12,CleanCombi!$A$1:$H$1826,4,0)","v":"ELECTRIC UFH"},null,null,{"$f":"VLOOKUP($G12,CleanCombi!$A$1:$H$1826,5,0)","v":"NO"},"N/A",{"$f":"VLOOKUP($G12,CleanCombi!$A$1:$H$1826,7,0)","v":"Room Temp"},"PLEASE SELECT"]
[{"$nulls":6},"K",{"$f":"VLOOKUP($G13,CleanCombi!$A$1:$H$1826,2,0)","v":"Heating"},"N/A",null,null,{"$f":"VLOOKUP($G13,CleanCombi!$A$1:$H$1826,4,0)","v":"ELECTRIC UFH"},null,null,{"$f":"VLOOKUP($G13,CleanCombi!$A$1:$H$1826,5,0)","v":"YES"},"PLEASE SELECT",{"$f":"VLOOKUP($G13,CleanCombi!$A$1:$H$1826,7,0)","v":"Room Temp"},"PLEASE SELECT"]
[{"$nulls":6},"L",{"$f":"VLOOKUP($G14,CleanCombi!$A$1:$H$1826,2,0)","v":"Heating"},"N/A",null,null,{"$f":"VLOOKUP($G14,CleanCombi!$A$1:$H$1826,4,0)","v":"ELECTRIC UFH"},null,null,{"$f":"VLOOKUP($G14,CleanCombi!$A$1:$H$1826,5,0)","v":"NO"},"N/A",{"$f":"VLOOKUP($G14,CleanCombi!$A$1:$H$1826,7,0)","v":"Floor Temp"},"Floor Probe"]
[{"$nulls":6},"M",{"$f":"VLOOKUP($G15,CleanCombi!$A$1:$H$1826,2,0)","v":"Heating"},"N/A",null,null,{"$f":"VLOOKUP($G15,CleanCombi!$A$1:$H$1826,4,0)","v":"RADIATOR"},null,null,{"$f":"VLOOKUP($G15,CleanCombi!$A$1:$H$1826,5,0)","v":"N/A"},"N/A",{"$f":"VLOOKUP($G15,CleanCombi!$A$1:$H$1826,7,0)","v":"Room Temp"},"PLEASE SELECT"]
[{"$nulls":6},"N",{"$f":"VLOOKUP($G16,CleanCombi!$A$1:$H$1826,2,0)","v":"ON/OFF SWITCH"},"N/A",null,null,{"$f":"VLOOKUP($G16,CleanCombi!$A$1:$H$1826,4,0)","v":"N/A"},null,null,{"$f":"VLOOKUP($G16,CleanCombi!$A$1:$H$1826,5,0)","v":"N/A"},"N/A",{"$f":"VLOOKUP($G16,CleanCombi!$A$1:$H$1826,7,0)","v":"ON/OFF Only"},"N/A"]
[{"$nulls":6},"O",{"$f":"VLOOKUP($G17,CleanCombi!$A$1:$H$1826,2,0)","v":"Towel Rad ON/OFF Only"},"N/A",null,null,{"$f":"VLOOKUP($G17,CleanCombi!$A$1:$H$1826,4,0)","v":"N/A"},null,null,{"$f":"VLOOKUP($G17,CleanCombi!$A$1:$H$1826,5,0)","v":"N/A"},"N/A",{"$f":"VLOOKUP($G17,CleanCombi!$A$1:$H$1826,7,0)","v":"ON/OFF Only"},"N/A"]
[{"$nulls":6},"P",{"$f":"VLOOKUP($G18,CleanCombi!$A$1:$H$1826,2,0)","v":"Towel Rad Temp Control"},"N/A",null,null,{"$f":"VLOOKUP($G18,CleanCombi!$A$1:$H$1826,4,0)","v":"RADIATOR"},null,null,{"$f":"VLOOKUP($G18,CleanCombi!$A$1:$H$1826,5,0)","v":"N/A"},"N/A",{"$f":"VLOOKUP($G18,CleanCombi!$A$1:$H$1826,7,0)","v":"Room Temp"},"PLEASE SELECT"]
[{"$nulls":6},"Q",{"$f":"VLOOKUP($G19,CleanCombi!$A$1:$H$1826,2,0)","v":"Hot Water ON/OFF"},"N/A",null,null,{"$f":"VLOOKUP($G19,CleanCombi!$A$1:$H$1826,4,0)","v":"N/A"},null,null,{"$f":"VLOOKUP($G19,CleanCombi!$A$1:$H$1826,5,0)","v":"N/A"},"N/A",{"$f":"VLOOKUP($G19,CleanCombi!$A$1:$H$1826,7,0)","v":"ON/OFF Only"},"N/A"]
[{"$nulls":6},"R",{"$f":"VLOOKUP($G20,CleanCombi!$A$1:$H$1826,2,0)","v":"Hot Water, Temp Control (Valve Only)"},"N/A",null,null,{"$f":"VLOOKUP($G20,CleanCombi!$A$1:$H$1826,4,0)","v":"N/A"},null,null,{"$f":"VLOOKUP($G20,CleanCombi!$A$1:$H$1826,5,0)","v":"N/A"},"N/A",{"$f":"VLOOKUP($G20,CleanCombi!$A$1:$H$1826,7,0)","v":"Cylinder Temp"},"Cylinder Probe"]
[{"$nulls":6},"S",{"$f":"VLOOKUP($G21,CleanCombi!$A$1:$H$1826,2,0)","v":"Hot Water, Temp Control (Valve & Boiler)"},"N/A",null,null,{"$f":"VLOOKUP($G21,CleanCombi!$A$1:$H$1826,4,0)","v":"N/A"},null,null,{"$f":"VLOOKUP($G21,CleanCombi!$A$1:$H$1826,5,0)","v":"N/A"},"N/A",{"$f":"VLOOKUP($G21,CleanCombi!$A$1:$H$1826,7,0)","v":"Cylinder Temp"},"Cylinder Probe"]
[{"$nulls":6},"FA",{"$f":"VLOOKUP($G22,CleanCombi!$A$1:$H$1826,2,0)","v":"Heating + FCU"},"PLEASE SELECT",null,null,{"$f":"VLOOKUP($G22,CleanCombi!$A$1:$H$1826,4,0)","v":"WET UFH"},null,null,{"$f":"VLOOKUP($G22,CleanCombi!$A$1:$H$1826,5,0)","v":"NO"},"N/A",{"$f":"VLOOKUP($G22,CleanCombi!$A$1:$H$1826,7,0)","v":"Room Temp"},"Wired Controller"]
[{"$nulls":6},"FB",{"$f":"VLOOKUP($G23,CleanCombi!$A$1:$H$1826,2,0)","v":"Heating + FCU"},"PLEASE SELECT",null,null,{"$f":"VLOOKUP($G23,CleanCombi!$A$1:$H$1826,4,0)","v":"WET UFH"},null,null,{"$f":"VLOOKUP($G23,CleanCombi!$A$1:$H$1826,5,0)","v":"YES"},"PLEASE SELECT",{"$f":"VLOOKUP($G23,CleanCombi!$A$1:$H$1826,7,0)","v":"Room Temp"},"Wired Controller"]
[{"$nulls":6},"FC",{"$f":"VLOOKUP($G24,CleanCombi!$A$1:$H$1826,2,0)","v":"Heating + FCU"},"PLEASE SELECT",null,null,{"$f":"VLOOKUP($G24,CleanCombi!$A$1:$H$1826,4,0)","v":"ELECTRIC UFH"},null,null,{"$f":"VLOOKUP($G24,CleanCombi!$A$1:$H$1826,5,0)","v":"NO"},"N/A",{"$f":"VLOOKUP($G24,CleanCombi!$A$1:$H$1826,7,0)","v":"Room Temp"},"Wired Controller"]
[{"$nulls":6},"FD",{"$f":"VLOOKUP($G25,CleanCombi!$A$1:$H$1826,2,0)","v":"Heating + FCU"},"PLEASE SELECT",null,null,{"$f":"VLOOKUP($G25,CleanCombi!$A$1:$H$1826,4,0)","v":"ELECTRIC UFH"},null,null,{"$f":"VLOOKUP($G25,CleanCombi!$A$1:$H$1826,5,0)","v":"YES"},"PLEASE SELECT",{"$f":"VLOOKUP($G25,CleanCombi!$A$1:$H$1826,7,0)","v":"Room Temp"},"Wired Controller"]
[{"$nulls":6},"FE",{"$f":"VLOOKUP($G26,CleanCombi!$A$1:$H$1826,2,0)","v":"Heating + FCU"},"PLEASE SELECT",null,null,{"$f":"VLOOKUP($G26,CleanCombi!$A$1:$H$1826,4,0)","v":"RADIATOR"},null,null,{"$f":"VLOOKUP($G26,CleanCombi!$A$1:$H$1826,5,0)","v":"N/A"},"N/A",{"$f":"VLOOKUP($G26,CleanCombi!$A$1:$H$1826,7,0)","v":"Room Temp"},"Wired Controller"]
[{"$nulls":6},"FF",{"$f":"VLOOKUP($G27,CleanCombi!$A$1:$H$1826,2,0)","v":"FCU Only"},"PLEASE SELECT",null,null,{"$f":"VLOOKUP($G27,CleanCombi!$A$1:$H$1826,4,0)","v":"N/A"},null,null,{"$f":"VLOOKUP($G27,CleanCombi!$A$1:$H$1826,5,0)","v":"N/A"},"N/A",{"$f":"VLOOKUP($G27,CleanCombi!$A$1:$H$1826,7,0)","v":"Room Temp"},"Wired Controller"]
[{"$nulls":6},"FAB",{"$f":"VLOOKUP($G28,CleanCombi!$A$1:$H$1826,2,0)","v":"Heating + FCU"},"PLEASE SELECT",null,null,{"$f":"VLOOKUP($G28,CleanCombi!$A$1:$H$1826,4,0)","v":"WET UFH"},null,null,{"$f":"VLOOKUP($G28,CleanCombi!$A$1:$H$1826,5,0)","v":"NO"},"N/A",{"$f":"VLOOKUP($G28,CleanCombi!$A$1:$H$1826,7,0)","v":"Room Temp"},"ClimateSync Room Sensor"]
[{"$nulls":6},"FBB",{"$f":"VLOOKUP($G29,CleanCombi!$A$1:$H$1826,2,0)","v":"Heating + FCU"},"PLEASE SELECT",null,null,{"$f":"VLOOKUP($G29,CleanCombi!$A$1:$H$1826,4,0)","v":"WET UFH"},null,null,{"$f":"VLOOKUP($G29,CleanCombi!$A$1:$H$1826,5,0)","v":"YES"},"PLEASE SELECT",{"$f":"VLOOKUP($G29,CleanCombi!$A$1:$H$1826,7,0)","v":"Room Temp"},"ClimateSync Room Sensor"]
[{"$nulls":6},"FCB",{"$f":"VLOOKUP($G30,CleanCombi!$A$1:$H$1826,2,0)","v":"Heating + FCU"},"PLEASE SELECT",null,null,{"$f":"VLOOKUP($G30,CleanCombi!$A$1:$H$1826,4,0)","v":"ELECTRIC UFH"},null,null,{"$f":"VLOOKUP($G30,CleanCombi!$A$1:$H$1826,5,0)","v":"NO"},"N/A",{"$f":"VLOOKUP($G30,CleanCombi!$A$1:$H$1826,7,0)","v":"Room Temp"},"ClimateSync Room Sensor"]
[{"$nulls":6},"FDB",{"$f":"VLOOKUP($G31,CleanCombi!$A$1:$H$1826,2,0)","v":"Heating + FCU"},"PLEASE SELECT",null,null,{"$f":"VLOOKUP($G31,CleanCombi!$A$1:$H$1826,4,0)","v":"ELECTRIC UFH"},null,null,{"$f":"VLOOKUP($G31,CleanCombi!$A$1:$H$1826,5,0)","v":"YES"},"PLEASE SELECT",{"$f":"VLOOKUP($G31,CleanCombi!$A$1:$H$1826,7,0)","v":"Room Temp"},"ClimateSync Room Sensor"]
[{"$nulls":6},"FEB",{"$f":"VLOOKUP($G32,CleanCombi!$A$1:$H$1826,2,0)","v":"Heating + FCU"},"PLEASE SELECT",null,null,{"$f":"VLOOKUP($G32,CleanCombi!$A$1:$H$1826,4,0)","v":"RADIATOR"},null,null,{"$f":"VLOOKUP($G32,CleanCombi!$A$1:$H$1826,5,0)","v":"N/A"},"N/A",{"$f":"VLOOKUP($G32,CleanCombi!$A$1:$H$1826,7,0)","v":"Room Temp"},"ClimateSync Room Sensor"]
[{"$nulls":6},"FFB",{"$f":"VLOOKUP($G33,CleanCombi!$A$1:$H$1826,2,0)","v":"FCU Only"},"PLEASE SELECT",null,null,{"$f":"VLOOKUP($G33,CleanCombi!$A$1:$H$1826,4,0)","v":"N/A"},null,null,{"$f":"VLOOKUP($G33,CleanCombi!$A$1:$H$1826,5,0)","v":"N/A"},"N/A",{"$f":"VLOOKUP($G33,CleanCombi!$A$1:$H$1826,7,0)","v":"Room Temp"},"ClimateSync Room Sensor"]
["1. Please Enable Macros.     2. Please add your project below this line.     3. Start by selecting the Zone Application Type."]
[{"$nulls":4},"ClimateSync 1","1-1","PLEASE SELECT",{"$f":"VLOOKUP($G35,CleanCombi!$A$1:$H$1826,2,0)","v":"First Select Zone Application Type"},{"$nulls":3},{"$f":"VLOOKUP($G35,CleanCombi!$A$1:$H$1826,4,0)","v":"First Select Zone Application Type"},null,null,{"$f":"VLOOKUP($G35,CleanCombi!$A$1:$H$1826,5,0)","v":"First Select Zone Application Type"},null,{"$f":"VLOOKUP($G35,CleanCombi!$A$1:$H$1826,7,0)","v":"First Select Zone Application Type"},{"$nulls":3},"001",{"$nulls":3},{"$f":"U35","v":"001"}]
[{"$nulls":5},"1-2","PLEASE SELECT",{"$f":"VLOOKUP($G36,CleanCombi!$A$1:$H$1826,2,0)","v":"First Select Zone Application Type"},{"$nulls":3},{"$f":"VLOOKUP($G36,CleanCombi!$A$1:$H$1826,4,0)","v":"First Select Zone Application Type"},null,null,{"$f":"VLOOKUP($G36,CleanCombi!$A$1:$H$1826,5,0)","v":"First Select Zone Application Type"},null,{"$f":"VLOOKUP($G36,CleanCombi!$A$1:$H$1826,7,0)","v":"First Select Zone Application Type"},{"$nulls":3},"002",{"$nulls":3},{"$f":"U36","v":"002"}]
[{"$nulls":5},"1-3","PLEASE SELECT",{"$f":"VLOOKUP($G37,CleanCombi!$A$1:$H$1826,2,0)","v":"First Select Zone Application Type"},{"$nulls":3},{"$f":"VLOOKUP($G37,CleanCombi!$A$1:$H$1826,4,0)","v":"First Select Zone Application Type"},null,null,{"$f":"VLOOKUP($G37,CleanCombi!$A$1:$H$1826,5,0)","v":"First Select Zone Application Type"},null,{"$f":"VLOOKUP($G37,CleanCombi!$A$1:$H$1826,7,0)","v":"First Select Zone Application Type"},{"$nulls":3},"003",{"$nulls":3},"003"]
[{"$nulls":5},"1-4","PLEASE SELECT",{"$f":"VLOOKUP($G38,CleanCombi!$A$1:$H$1826,2,0)","v":"First Select Zone Application Type"},{"$nulls":3},{"$f":"VLOOKUP($G38,CleanCombi!$A$1:$H$1826,4,0)","v":"First Select Zone Application Type"},null,null,{"$f":"VLOOKUP($G38,CleanCombi!$A$1:$H$1826,5,0)","v":"First Select Zone Application Type"},null,{"$f":"VLOOKUP($G38,CleanCombi!$A$1:$H$1826,7,0)","v":"First Select Zone Application Type"},{"$nulls":3},"004",{"$nulls":3},"004"]
[{"$nulls":5},"1-5","PLEASE SELECT",{"$f":"VLOOKUP($G39,CleanCombi!$A$1:$H$1826,2,0)","v":"First Select Zone Application Type"},{"$nulls":3},{"$f":"VLOOKUP($G39,CleanCombi!$A$1:$H$1826,4,0)","v":"First Select Zone Application Type"},null,null,{"$f":"VLOOKUP($G39,CleanCombi!$A$1:$H$1826,5,0)","v":"First Select Zone Application Type"},null,{"$f":"VLOOKUP($G39,CleanCombi!$A$1:$H$1826,7,0)","v":"First Select Zone Application Type"},{"$nulls":3},"005",{"$nulls":3},"005"]
[{"$nulls":5},"1-6","PLEASE SELECT",{"$f":"VLOOKUP($G40,CleanCombi!$A$1:$H$1826,2,0)","v":"First Select Zone Application Type"},{"$nulls":3},{"$f":"VLOOKUP($G40,CleanCombi!$A$1:$H$1826,4,0)","v":"First Select Zone Application Type"},null,null,{"$f":"VLOOKUP($G40,CleanCombi!$A$1:$H$1826,5,0)","v":"First Select Zone Application Type"},null,{"$f":"VLOOKUP($G40,CleanCombi!$A$1:$H$1826,7,0)","v":"First Select Zone Application Type"},{"$nulls":3},"006",{"$nulls":3},"006"]
[{"$nulls":5},"1-7","PLEASE SELECT",{"$f":"VLOOKUP($G41,CleanCombi!$A$1:$H$1826,2,0)","v":"First Select Zone Application Type"},{"$nulls":3},{"$f":"VLOOKUP($G41,CleanCombi!$A$1:$H$1826,4,0)","v":"First Select Zone Application Type"},null,null,{"$f":"VLOOKUP($G41,CleanCombi!$A$1:$H$1826,5,0)","v":"First Select Zone Application Type"},null,{"$f":"VLOOKUP($G41,CleanCombi!$A$1:$H$1826,7,0)","v":"First Select Zone Application Type"},{"$nulls":3},"007",{"$nulls":3},"007"]
[{"$nulls":5},"1-8","PLEASE SELECT",{"$f":"VLOOKUP($G42,CleanCombi!$A$1:$H$1826,2,0)","v":"First Select Zone Application Type"},{"$nulls":3},{"$f":"VLOOKUP($G42,CleanCombi!$A$1:$H$1826,4,0)","v":"First Select Zone Application Type"},null,null,{"$f":"VLOOKUP($G42,CleanCombi!$A$1:$H$1826,5,0)","v":"First Select Zone Application Type"},null,{"$f":"VLOOKUP($G42,CleanCombi!$A$1:$H$1826,7,0)","v":"First Select Zone Application Type"},{"$nulls":3},"008",{"$nulls":3},"008"]
[{"$nulls":4},"ClimateSync 2","2-1","PLEASE SELECT",{"$f":"VLOOKUP($G43,CleanCombi!$A$1:$H$1826,2,0)","v":"First Select Zone Application Type"},{"$nulls":3},{"$f":"VLOOKUP($G43,CleanCombi!$A$1:$H$1826,4,0)","v":"First Select Zone Application Type"},null,null,{"$f":"VLOOKUP($G43,CleanCombi!$A$1:$H$1826,5,0)","v":"First Select Zone Application Type"},null,{"$f":"VLOOKUP($G43,CleanCombi!$A$1:$H$1826,7,0)","v":"First Select Zone Application Type"},{"$nulls":3},"011",{"$nulls":3},"011"]
[{"$nulls":5},"2-2","PLEASE SELECT",{"$f":"VLOOKUP($G44,CleanCombi!$A$1:$H$1826,2,0)","v":"First Select Zone Application Type"},{"$nulls":3},{"$f":"VLOOKUP($G44,CleanCombi!$A$1:$H$1826,4,0)","v":"First Select Zone Application Type"},null,null,{"$f":"VLOOKUP($G44,CleanCombi!$A$1:$H$1826,5,0)","v":"First Select Zone Application Type"},null,{"$f":"VLOOKUP($G44,CleanCombi!$A$1:$H$1826,7,0)","v":"First Select Zone Application Type"},{"$nulls":3},"012",{"$nulls":3},"012"]
[{"$nulls":5},"2-3","PLEASE SELECT",{"$f":"VLOOKUP($G45,CleanCombi!$A$1:$H$1826,2,0)","v":"First Select Zone Application Type"},{"$nulls":3},{"$f":"VLOOKUP($G45,CleanCombi!$A$1:$H$1826,4,0)","v":"First Select Zone Application Type"},null,null,{"$f":"VLOOKUP($G45,CleanCombi!$A$1:$H$1826,5,0)","v":"First Select Zone Application Type"},null,{"$f":"VLOOKUP($G45,CleanCombi!$A$1:$H$1826,7,0)","v":"First Select Zone Application Type"},{"$nulls":3},"013",{"$nulls":3},"013"]
[{"$nulls":5},"2-4","PLEASE SELECT",{"$f":"VLOOKUP($G46,CleanCombi!$A$1:$H$1826,2,0)","v":"First Select Zone Application Type"},{"$nulls":3},{"$f":"VLOOKUP($G46,CleanCombi!$A$1:$H$1826,4,0)","v":"First Select Zone Application Type"},null,null,{"$f":"VLOOKUP($G46,CleanCombi!$A$1:$H$1826,5,0)","v":"First Select Zone Application Type"},null,{"$f":"VLOOKUP($G46,CleanCombi!$A$1:$H$1826,7,0)","v":"First Select Zone Application Type"},{"$nulls":3},"014",{"$nulls":3},"014"]
[{"$nulls":5},"2-5","PLEASE SELECT",{"$f":"VLOOKUP($G47,CleanCombi!$A$1:$H$1826,2,0)","v":"First Select Zone Application Type"},{"$nulls":3},{"$f":"VLOOKUP($G47,CleanCombi!$A$1:$H$1826,4,0)","v":"First Select Zone Application Type"},null,null,{"$f":"VLOOKUP($G47,CleanCombi!$A$1:$H$1826,5,0)","v":"First Select Zone Application Type"},null,{"$f":"VLOOKUP($G47,CleanCombi!$A$1:$H$1826,7,0)","v":"First Select Zone Application Type"},{"$nulls":3},"015",{"$nulls":3},"015"]
[{"$nulls":5},"2-6","PLEASE SELECT",{"$f":"VLOOKUP($G48,CleanCombi!$A$1:$H$1826,2,0)","v":"First Select Zone Application Type"},{"$nulls":3},{"$f":"VLOOKUP($G48,CleanCombi!$A$1:$H$1826,4,0)","v":"First Select Zone Application Type"},null,null,{"$f":"VLOOKUP($G48,CleanCombi!$A$1:$H$1826,5,0)","v":"First Select Zone Application Type"},null,{"$f":"VLOOKUP($G48,CleanCombi!$A$1:$H$1826,7,0)","v":"First Select Zone Application Type"},{"$nulls":3},"016",{"$nulls":3},"016"]
[{"$nulls":5},"2-7","PLEASE SELECT",{"$f":"VLOOKUP($G49,CleanCombi!$A$1:$H$1826,2,0)","v":"First Select Zone Application Type"},{"$nulls":3},{"$f":"VLOOKUP($G49,CleanCombi!$A$1:$H$1826,4,0)","v":"First Select Zone Application Type"},null,null,{"$f":"VLOOKUP($G49,CleanCombi!$A$1:$H$1826,5,0)","v":"First Select Zone Application Type"},null,{"$f":"VLOOKUP($G49,CleanCombi!$A$1:$H$1826,7,0)","v":"First Select Zone Application Type"},{"$nulls":3},"017",{"$nulls":3},"017"]
[{"$nulls":5},"2-8","PLEASE SELECT",{"$f":"VLOOKUP($G50,CleanCombi!$A$1:$H$1826,2,0)","v":"First Select Zone Application Type"},{"$nulls":3},{"$f":"VLOOKUP($G50,CleanCombi!$A$1:$H$1826,4,0)","v":"First Select Zone Application Type"},null,null,{"$f":"VLOOKUP($G50,CleanCombi!$A$1:$H$1826,5,0)","v":"First Select Zone Application Type"},null,{"$f":"VLOOKUP($G50,CleanCombi!$A$1:$H$1826,7,0)","v":"First Select Zone Application Type"},{"$nulls":3},"018",{"$nulls":3},"018"]
[{"$nulls":4},"ClimateSync 3","3-1","PLEASE SELECT",{"$f":"VLOOKUP($G51,CleanCombi!$A$1:$H$1826,2,0)","v":"First Select Zone Application Type"},{"$nulls":3},{"$f":"VLOOKUP($G51,CleanCombi!$A$1:$H$1826,4,0)","v":"First Select Zone Application Type"},null,null,{"$f":"VLOOKUP($G51,CleanCombi!$A$1:$H$1826,5,0)","v":"First Select Zone Application Type"},null,{"$f":"VLOOKUP($G51,CleanCombi!$A$1:$H$1826,7,0)","v":"First Select Zone Application Type"},{"$nulls":3},"021",{"$nulls":3},"021"]
[{"$nulls":5},"3-2","PLEASE SELECT",{"$f":"VLOOKUP($G52,CleanCombi!$A$1:$H$1826,2,0)","v":"First Select Zone Application Type"},{"$nulls":3},{"$f":"VLOOKUP($G52,CleanCombi!$A$1:$H$1826,4,0)","v":"First Select Zone Application Type"},null,null,{"$f":"VLOOKUP($G52,CleanCombi!$A$1:$H$1826,5,0)","v":"First Select Zone Application Type"},null,{"$f":"VLOOKUP($G52,CleanCombi!$A$1:$H$1826,7,0)","v":"First Select Zone Application Type"},{"$nulls":3},"022",{"$nulls":3},"022"]
[{"$nulls":5},"3-3","PLEASE SELECT",{"$f":"VLOOKUP($G53,CleanCombi!$A$1:$H$1826,2,0)","v":"First Select Zone Application Type"},{"$nulls":3},{"$f":"VLOOKUP($G53,CleanCombi!$A$1:$H$1826,4,0)","v":"First Select Zone Application Type"},null,null,{"$f":"VLOOKUP($G53,CleanCombi!$A$1:$H$1826,5,0)","v":"First Select Zone Application Type"},null,{"$f":"VLOOKUP($G53,CleanCombi!$A$1:$H$1826,7,0)","v":"First Select Zone Application Type"},{"$nulls":3},"023",{"$nulls":3},"023"]
[{"$nulls":5},"3-4","PLEASE SELECT",{"$f":"VLOOKUP($G54,CleanCombi!$A$1:$H$1826,2,0)","v":"First Select Zone Application Type"},{"$nulls":3},{"$f":"VLOOKUP($G54,CleanCombi!$A$1:$H$1826,4,0)","v":"First Select Zone Application Type"},null,null,{"$f":"VLOOKUP($G54,CleanCombi!$A$1:$H$1826,5,0)","v":"First Select Zone Application Type"},null,{"$f":"VLOOKUP($G54,CleanCombi!$A$1:$H$1826,7,0)","v":"First Select Zone Application Type"},{"$nulls":3},"024",{"$nulls":3},"024"]
[{"$nulls":5},"3-5","PLEASE SELECT",{"$f":"VLOOKUP($G55,CleanCombi!$A$1:$H$1826,2,0)","v":"First Select Zone Application Type"},{"$nulls":3},{"$f":"VLOOKUP($G55,CleanCombi!$A$1:$H$1826,4,0)","v":"First Select Zone Application Type"},null,null,{"$f":"VLOOKUP($G55,CleanCombi!$A$1:$H$1826,5,0)","v":"First Select Zone Application Type"},null,{"$f":"VLOOKUP($G55,CleanCombi!$A$1:$H$1826,7,0)","v":"First Select Zone Application Type"},{"$nulls":3},"025",{"$nulls":3},"025"]
[{"$nulls":5},"3-6","PLEASE SELECT",{"$f":"VLOOKUP($G56,CleanCombi!$A$1:$H$1826,2,0)","v":"First Select Zone Application Type"},{"$nulls":3},{"$f":"VLOOKUP($G56,CleanCombi!$A$1:$H$1826,4,0)","v":"First Select Zone Application Type"},null,null,{"$f":"VLOOKUP($G56,CleanCombi!$A$1:$H$1826,5,0)","v":"First Select Zone Application Type"},null,{"$f":"VLOOKUP($G56,CleanCombi!$A$1:$H$1826,7,0)","v":"First Select Zone Application Type"},{"$nulls":3},"026",{"$nulls":3},"026"]
[{"$nulls":5},"3-7","PLEASE SELECT",{"$f":"VLOOKUP($G57,CleanCombi!$A$1:$H$1826,2,0)","v":"First Select Zone Application Type"},{"$nulls":3},{"$f":"VLOOKUP($G57,CleanCombi!$A$1:$H$1826,4,0)","v":"First Select Zone Application Type"},null,null,{"$f":"VLOOKUP($G57,CleanCombi!$A$1:$H$1826,5,0)","v":"First Select Zone Application Type"},null,{"$f":"VLOOKUP($G57,CleanCombi!$A$1:$H$1826,7,0)","v":"First Select Zone Application Type"},{"$nulls":3},"027",{"$nulls":3},"027"]
[{"$nulls":5},"3-8","PLEASE SELECT",{"$f":"VLOOKUP($G58,CleanCombi!$A$1:$H$1826,2,0)","v":"First Select Zone Application Type"},{"$nulls":3},{"$f":"VLOOKUP($G58,CleanCombi!$A$1:$H$1826,4,0)","v":"First Select Zone Application Type"},null,null,{"$f":"VLOOKUP($G58,CleanCombi!$A$1:$H$1826,5,0)","v":"First Select Zone Application Type"},null,{"$f":"VLOOKUP($G58,CleanCombi!$A$1:$H$1826,7,0)","v":"First Select Zone Application Type"},{"$nulls":3},"028",{"$nulls":3},"028"]
[{"$nulls":4},"ClimateSync 4","4-1","PLEASE SELECT",{"$f":"VLOOKUP($G59,CleanCombi!$A$1:$H$1826,2,0)","v":"First Select Zone Application Type"},{"$nulls":3},{"$f":"VLOOKUP($G59,CleanCombi!$A$1:$H$1826,4,0)","v":"First Select Zone Application Type"},null,null,{"$f":"VLOOKUP($G59,CleanCombi!$A$1:$H$1826,5,0)","v":"First Select Zone Application Type"},null,{"$f":"VLOOKUP($G59,CleanCombi!$A$1:$H$1826,7,0)","v":"First Select Zone Application Type"},{"$nulls":3},"031",{"$nulls":3},"031"]
[{"$nulls":5},"4-2","PLEASE SELECT",{"$f":"VLOOKUP($G60,CleanCombi!$A$1:$H$1826,2,0)","v":"First Select Zone Application Type"},{"$nulls":3},{"$f":"VLOOKUP($G60,CleanCombi!$A$1:$H$1826,4,0)","v":"First Select Zone Application Type"},null,null,{"$f":"VLOOKUP($G60,CleanCombi!$A$1:$H$1826,5,0)","v":"First Select Zone Application Type"},null,{"$f":"VLOOKUP($G60,CleanCombi!$A$1:$H$1826,7,0)","v":"First Select Zone Application Type"},{"$nulls":3},"032",{"$nulls":3},"032"]
[{"$nulls":5},"4-3","PLEASE SELECT",{"$f":"VLOOKUP($G61,CleanCombi!$A$1:$H$1826,2,0)","v":"First Select Zone Application Type"},{"$nulls":3},{"$f":"VLOOKUP($G61,CleanCombi!$A$1:$H$1826,4,0)","v":"First Select Zone Application Type"},null,null,{"$f":"VLOOKUP($G61,CleanCombi!$A$1:$H$1826,5,0)","v":"First Select Zone Application Type"},null,{"$f":"VLOOKUP($G61,CleanCombi!$A$1:$H$1826,7,0)","v":"First Select Zone Application Type"},{"$nulls":3},"033",{"$nulls":3},"033"]
[{"$nulls":5},"4-4","PLEASE SELECT",{"$f":"VLOOKUP($G62,CleanCombi!$A$1:$H$1826,2,0)","v":"First Select Zone Application Type"},{"$nulls":3},{"$f":"VLOOKUP($G62,CleanCombi!$A$1:$H$1826,4,0)","v":"First Select Zone Application Type"},null,null,{"$f":"VLOOKUP($G62,CleanCombi!$A$1:$H$1826,5,0)","v":"First Select Zone Application Type"},null,{"$f":"VLOOKUP($G62,CleanCombi!$A$1:$H$1826,7,0)","v":"First Select Zone Application Type"},{"$nulls":3},"034",{"$nulls":3},"034"]
[{"$nulls":5},"4-5","PLEASE SELECT",{"$f":"VLOOKUP($G63,CleanCombi!$A$1:$H$1826,2,0)","v":"First Select Zone Application Type"},{"$nulls":3},{"$f":"VLOOKUP($G63,CleanCombi!$A$1:$H$1826,4,0)","v":"First Select Zone Application Type"},null,null,{"$f":"VLOOKUP($G63,CleanCombi!$A$1:$H$1826,5,0)","v":"First Select Zone Application Type"},null,{"$f":"VLOOKUP($G63,CleanCombi!$A$1:$H$1826,7,0)","v":"First Select Zone Application Type"},{"$nulls":3},"035",{"$nulls":3},"035"]
[{"$nulls":5},"4-6","PLEASE SELECT",{"$f":"VLOOKUP($G64,CleanCombi!$A$1:$H$1826,2,0)","v":"First Select Zone Application Type"},{"$nulls":3},{"$f":"VLOOKUP($G64,CleanCombi!$A$1:$H$1826,4,0)","v":"First Select Zone Application Type"},null,null,{"$f":"VLOOKUP($G64,CleanCombi!$A$1:$H$1826,5,0)","v":"First Select Zone Application Type"},null,{"$f":"VLOOKUP($G64,CleanCombi!$A$1:$H$1826,7,0)","v":"First Select Zone Application Type"},{"$nulls":3},"036",{"$nulls":3},"036"]
[{"$nulls":5},"4-7","PLEASE SELECT",{"$f":"VLOOKUP($G65,CleanCombi!$A$1:$H$1826,2,0)","v":"First Select Zone Application Type"},{"$nulls":3},{"$f":"VLOOKUP($G65,CleanCombi!$A$1:$H$1826,4,0)","v":"First Select Zone Application Type"},null,null,{"$f":"VLOOKUP($G65,CleanCombi!$A$1:$H$1826,5,0)","v":"First Select Zone Application Type"},null,{"$f":"VLOOKUP($G65,CleanCombi!$A$1:$H$1826,7,0)","v":"First Select Zone Application Type"},{"$nulls":3},"037",{"$nulls":3},"037"]
[{"$nulls":5},"4-8","PLEASE SELECT",{"$f":"VLOOKUP($G66,CleanCombi!$A$1:$H$1826,2,0)","v":"First Select Zone Application Type"},{"$nulls":3},{"$f":"VLOOKUP($G66,CleanCombi!$A$1:$H$1826,4,0)","v":"First Select Zone Application Type"},null,null,{"$f":"VLOOKUP($G66,CleanCombi!$A$1:$H$1826,5,0)","v":"First Select Zone Application Type"},null,{"$f":"VLOOKUP($G66,CleanCombi!$A$1:$H$1826,7,0)","v":"First Select Zone Application Type"},{"$nulls":3},"038",{"$nulls":3},"038"]
[{"$nulls":4},"ClimateSync 5","5-1","PLEASE SELECT",{"$f":"VLOOKUP($G67,CleanCombi!$A$1:$H$1826,2,0)","v":"First Select Zone Application Type"},{"$nulls":3},{"$f":"VLOOKUP($G67,CleanCombi!$A$1:$H$1826,4,0)","v":"First Select Zone Application Type"},null,null,{"$f":"VLOOKUP($G67,CleanCombi!$A$1:$H$1826,5,0)","v":"First Select Zone Application Type"},null,{"$f":"VLOOKUP($G67,CleanCombi!$A$1:$H$1826,7,0)","v":"First Select Zone Application Type"},{"$nulls":3},"041",{"$nulls":3},"041"]
[{"$nulls":5},"5-2","PLEASE SELECT",{"$f":"VLOOKUP($G68,CleanCombi!$A$1:$H$1826,2,0)","v":"First Select Zone Application Type"},{"$nulls":3},{"$f":"VLOOKUP($G68,CleanCombi!$A$1:$H$1826,4,0)","v":"First Select Zone Application Type"},null,null,{"$f":"VLOOKUP($G68,CleanCombi!$A$1:$H$1826,5,0)","v":"First Select Zone Application Type"},null,{"$f":"VLOOKUP($G68,CleanCombi!$A$1:$H$1826,7,0)","v":"First Select Zone Application Type"},{"$nulls":3},"042",{"$nulls":3},"042"]
[{"$nulls":5},"5-3","PLEASE SELECT",{"$f":"VLOOKUP($G69,CleanCombi!$A$1:$H$1826,2,0)","v":"First Select Zone Application Type"},{"$nulls":3},{"$f":"VLOOKUP($G69,CleanCombi!$A$1:$H$1826,4,0)","v":"First Select Zone Application Type"},null,null,{"$f":"VLOOKUP($G69,CleanCombi!$A$1:$H$1826,5,0)","v":"First Select Zone Application Type"},null,{"$f":"VLOOKUP($G69,CleanCombi!$A$1:$H$1826,7,0)","v":"First Select Zone Application Type"},{"$nulls":3},"043",{"$nulls":3},"043"]
[{"$nulls":5},"5-4","PLEASE SELECT",{"$f":"VLOOKUP($G70,CleanCombi!$A$1:$H$1826,2,0)","v":"First Select Zone Application Type"},{"$nulls":3},{"$f":"VLOOKUP($G70,CleanCombi!$A$1:$H$1826,4,0)","v":"First Select Zone Application Type"},null,null,{"$f":"VLOOKUP($G70,CleanCombi!$A$1:$H$1826,5,0)","v":"First Select Zone Application Type"},null,{"$f":"VLOOKUP($G70,CleanCombi!$A$1:$H$1826,7,0)","v":"First Select Zone Application Type"},{"$nulls":3},"044",{"$nulls":3},"044"]
[{"$nulls":5},"5-5","PLEASE SELECT",{"$f":"VLOOKUP($G71,CleanCombi!$A$1:$H$1826,2,0)","v":"First Select Zone Application Type"},{"$nulls":3},{"$f":"VLOOKUP($G71,CleanCombi!$A$1:$H$1826,4,0)","v":"First Select Zone Application Type"},null,null,{"$f":"VLOOKUP($G71,CleanCombi!$A$1:$H$1826,5,0)","v":"First Select Zone Application Type"},null,{"$f":"VLOOKUP($G71,CleanCombi!$A$1:$H$1826,7,0)","v":"First Select Zone Application Type"},{"$nulls":3},"045",{"$nulls":3},"045"]
[{"$nulls":5},"5-6","PLEASE SELECT",{"$f":"VLOOKUP($G72,CleanCombi!$A$1:$H$1826,2,0)","v":"First Select Zone Application Type"},{"$nulls":3},{"$f":"VLOOKUP($G72,CleanCombi!$A$1:$H$1826,4,0)","v":"First Select Zone Application Type"},null,null,{"$f":"VLOOKUP($G72,CleanCombi!$A$1:$H$1826,5,0)","v":"First Select Zone Application Type"},null,{"$f":"VLOOKUP($G72,CleanCombi!$A$1:$H$1826,7,0)","v":"First Select Zone Application Type"},{"$nulls":3},"046",{"$nulls":3},"046"]
[{"$nulls":5},"5-7","PLEASE SELECT",{"$f":"VLOOKUP($G73,CleanCombi!$A$1:$H$1826,2,0)","v":"First Select Zone Application Type"},{"$nulls":3},{"$f":"VLOOKUP($G73,CleanCombi!$A$1:$H$1826,4,0)","v":"First Select Zone Application Type"},null,null,{"$f":"VLOOKUP($G73,CleanCombi!$A$1:$H$1826,5,0)","v":"First Select Zone Application Type"},null,{"$f":"VLOOKUP($G73,CleanCombi!$A$1:$H$1826,7,0)","v":"First Select Zone Application Type"},{"$nulls":3},"047",{"$nulls":3},"047"]
[{"$nulls":5},"5-8","PLEASE SELECT",{"$f":"VLOOKUP($G74,CleanCombi!$A$1:$H$1826,2,0)","v":"First Select Zone Application Type"},{"$nulls":3},{"$f":"VLOOKUP($G74,CleanCombi!$A$1:$H$1826,4,0)","v":"First Select Zone Application Type"},null,null,{"$f":"VLOOKUP($G74,CleanCombi!$A$1:$H$1826,5,0)","v":"First Select Zone Application Type"},null,{"$f":"VLOOKUP($G74,CleanCombi!$A$1:$H$1826,7,0)","v":"First Select Zone Application Type"},{"$nulls":3},"048",{"$nulls":3},"048"]
[{"$nulls":4},"ClimateSync 6","6-1","PLEASE SELECT",{"$f":"VLOOKUP($G75,CleanCombi!$A$1:$H$1826,2,0)","v":"First Select Zone Application Type"},{"$nulls":3},{"$f":"VLOOKUP($G75,CleanCombi!$A$1:$H$1826,4,0)","v":"First Select Zone Application Type"},null,null,{"$f":"VLOOKUP($G75,CleanCombi!$A$1:$H$1826,5,0)","v":"First Select Zone Application Type"},null,{"$f":"VLOOKUP($G75,CleanCombi!$A$1:$H$1826,7,0)","v":"First Select Zone Application Type"},{"$nulls":3},"051",{"$nulls":3},"051"]
[{"$nulls":5},"6-2","PLEASE SELECT",{"$f":"VLOOKUP($G76,CleanCombi!$A$1:$H$1826,2,0)","v":"First Select Zone Application Type"},{"$nulls":3},{"$f":"VLOOKUP($G76,CleanCombi!$A$1:$H$1826,4,0)","v":"First Select Zone Application Type"},null,null,{"$f":"VLOOKUP($G76,CleanCombi!$A$1:$H$1826,5,0)","v":"First Select Zone Application Type"},null,{"$f":"VLOOKUP($G76,CleanCombi!$A$1:$H$1826,7,0)","v":"First Select Zone Application Type"},{"$nulls":3},"052",{"$nulls":3},"052"]
[{"$nulls":5},"6-3","PLEASE SELECT",{"$f":"VLOOKUP($G77,CleanCombi!$A$1:$H$1826,2,0)","v":"First Select Zone Application Type"},{"$nulls":3},{"$f":"VLOOKUP($G77,CleanCombi!$A$1:$H$1826,4,0)","v":"First Select Zone Application Type"},null,null,{"$f":"VLOOKUP($G77,CleanCombi!$A$1:$H$1826,5,0)","v":"First Select Zone Application Type"},null,{"$f":"VLOOKUP($G77,CleanCombi!$A$1:$H$1826,7,0)","v":"First Select Zone Application Type"},{"$nulls":3},"053",{"$nulls":3},"053"]
[{"$nulls":5},"6-4","PLEASE SELECT",{"$f":"VLOOKUP($G78,CleanCombi!$A$1:$H$1826,2,0)","v":"First Select Zone Application Type"},{"$nulls":3},{"$f":"VLOOKUP($G78,CleanCombi!$A$1:$H$1826,4,0)","v":"First Select Zone Application Type"},null,null,{"$f":"VLOOKUP($G78,CleanCombi!$A$1:$H$1826,5,0)","v":"First Select Zone Application Type"},null,{"$f":"VLOOKUP($G78,CleanCombi!$A$1:$H$1826,7,0)","v":"First Select Zone Application Type"},{"$nulls":3},"054",{"$nulls":3},"054"]
[{"$nulls":5},"6-5","PLEASE SELECT",{"$f":"VLOOKUP($G79,CleanCombi!$A$1:$H$1826,2,0)","v":"First Select Zone Application Type"},{"$nulls":3},{"$f":"VLOOKUP($G79,CleanCombi!$A$1:$H$1826,4,0)","v":"First Select Zone Application Type"},null,null,{"$f":"VLOOKUP($G79,CleanCombi!$A$1:$H$1826,5,0)","v":"First Select Zone Application Type"},null,{"$f":"VLOOKUP($G79,CleanCombi!$A$1:$H$1826,7,0)","v":"First Select Zone Application Type"},{"$nulls":3},"055",{"$nulls":3},"055"]
[{"$nulls":5},"6-6","PLEASE SELECT",{"$f":"VLOOKUP($G80,CleanCombi!$A$1:$H$1826,2,0)","v":"First Select Zone Application Type"},{"$nulls":3},{"$f":"VLOOKUP($G80,CleanCombi!$A$1:$H$1826,4,0)","v":"First Select Zone Application Type"},null,null,{"$f":"VLOOKUP($G80,CleanCombi!$A$1:$H$1826,5,0)","v":"First Select Zone Application Type"},null,{"$f":"VLOOKUP($G80,CleanCombi!$A$1:$H$1826,7,0)","v":"First Select Zone Application Type"},{"$nulls":3},"056",{"$nulls":3},"056"]
[{"$nulls":5},"6-7","PLEASE SELECT",{"$f":"VLOOKUP($G81,CleanCombi!$A$1:$H$1826,2,0)","v":"First Select Zone Application Type"},{"$nulls":3},{"$f":"VLOOKUP($G81,CleanCombi!$A$1:$H$1826,4,0)","v":"First Select Zone Application Type"},null,null,{"$f":"VLOOKUP($G81,CleanCombi!$A$1:$H$1826,5,0)","v":"First Select Zone Application Type"},null,{"$f":"VLOOKUP($G81,CleanCombi!$A$1:$H$1826,7,0)","v":"First Select Zone Application Type"},{"$nulls":3},"057",{"$nulls":3},"057"]
[{"$nulls":5},"6-8","PLEASE SELECT",{"$f":"VLOOKUP($G82,CleanCombi!$A$1:$H$1826,2,0)","v":"First Select Zone Application Type"},{"$nulls":3},{"$f":"VLOOKUP($G82,CleanCombi!$A$1:$H$1826,4,0)","v":"First Select Zone Application Type"},null,null,{"$f":"VLOOKUP($G82,CleanCombi!$A$1:$H$1826,5,0)","v":"First Select Zone Application Type"},null,{"$f":"VLOOKUP($G82,CleanCombi!$A$1:$H$1826,7,0)","v":"First Select Zone Application Type"},{"$nulls":3},"058",{"$nulls":3},"058"]
[{"$nulls":4},"ClimateSync 7","7-1","PLEASE SELECT",{"$f":"VLOOKUP($G83,CleanCombi!$A$1:$H$1826,2,0)","v":"First Select Zone Application Type"},{"$nulls":3},{"$f":"VLOOKUP($G83,CleanCombi!$A$1:$H$1826,4,0)","v":"First Select Zone Application Type"},null,null,{"$f":"VLOOKUP($G83,CleanCombi!$A$1:$H$1826,5,0)","v":"First Select Zone Application Type"},null,{"$f":"VLOOKUP($G83,CleanCombi!$A$1:$H$1826,7,0)","v":"First Select Zone Application Type"},{"$nulls":3},"061",{"$nulls":3},"061"]
[{"$nulls":5},"7-2","PLEASE SELECT",{"$f":"VLOOKUP($G84,CleanCombi!$A$1:$H$1826,2,0)","v":"First Select Zone Application Type"},{"$nulls":3},{"$f":"VLOOKUP($G84,CleanCombi!$A$1:$H$1826,4,0)","v":"First Select Zone Application Type"},null,null,{"$f":"VLOOKUP($G84,CleanCombi!$A$1:$H$1826,5,0)","v":"First Select Zone Application Type"},null,{"$f":"VLOOKUP($G84,CleanCombi!$A$1:$H$1826,7,0)","v":"First Select Zone Application Type"},{"$nulls":3},"062",{"$nulls":3},"062"]
[{"$nulls":5},"7-3","PLEASE SELECT",{"$f":"VLOOKUP($G85,CleanCombi!$A$1:$H$1826,2,0)","v":"First Select Zone Application Type"},{"$nulls":3},{"$f":"VLOOKUP($G85,CleanCombi!$A$1:$H$1826,4,0)","v":"First Select Zone Application Type"},null,null,{"$f":"VLOOKUP($G85,CleanCombi!$A$1:$H$1826,5,0)","v":"First Select Zone Application Type"},null,{"$f":"VLOOKUP($G85,CleanCombi!$A$1:$H$1826,7,0)","v":"First Select Zone Application Type"},{"$nulls":3},"063",{"$nulls":3},"063"]
[{"$nulls":5},"7-4","PLEASE SELECT",{"$f":"VLOOKUP($G86,CleanCombi!$A$1:$H$1826,2,0)","v":"First Select Zone Application Type"},{"$nulls":3},{"$f":"VLOOKUP($G86,CleanCombi!$A$1:$H$1826,4,0)","v":"First Select Zone Application Type"},null,null,{"$f":"VLOOKUP($G86,CleanCombi!$A$1:$H$1826,5,0)","v":"First Select Zone Application Type"},null,{"$f":"VLOOKUP($G86,CleanCombi!$A$1:$H$1826,7,0)","v":"First Select Zone Application Type"},{"$nulls":3},"064",{"$nulls":3},"064"]
[{"$nulls":5},"7-5","PLEASE SELECT",{"$f":"VLOOKUP($G87,CleanCombi!$A$1:$H$1826,2,0)","v":"First Select Zone Application Type"},{"$nulls":3},{"$f":"VLOOKUP($G87,CleanCombi!$A$1:$H$1826,4,0)","v":"First Select Zone Application Type"},null,null,{"$f":"VLOOKUP($G87,CleanCombi!$A$1:$H$1826,5,0)","v":"First Select Zone Application Type"},null,{"$f":"VLOOKUP($G87,CleanCombi!$A$1:$H$1826,7,0)","v":"First Select Zone Application Type"},{"$nulls":3},"065",{"$nulls":3},"065"]
[{"$nulls":5},"7-6","PLEASE SELECT",{"$f":"VLOOKUP($G88,CleanCombi!$A$1:$H$1826,2,0)","v":"First Select Zone Application Type"},{"$nulls":3},{"$f":"VLOOKUP($G88,CleanCombi!$A$1:$H$1826,4,0)","v":"First Select Zone Application Type"},null,null,{"$f":"VLOOKUP($G88,CleanCombi!$A$1:$H$1826,5,0)","v":"First Select Zone Application Type"},null,{"$f":"VLOOKUP($G88,CleanCombi!$A$1:$H$1826,7,0)","v":"First Select Zone Application Type"},{"$nulls":3},"066",{"$nulls":3},"066"]
[{"$nulls":5},"7-7","PLEASE SELECT",{"$f":"VLOOKUP($G89,CleanCombi!$A$1:$H$1826,2,0)","v":"First Select Zone Application Type"},{"$nulls":3},{"$f":"VLOOKUP($G89,CleanCombi!$A$1:$H$1826,4,0)","v":"First Select Zone Application Type"},null,null,{"$f":"VLOOKUP($G89,CleanCombi!$A$1:$H$1826,5,0)","v":"First Select Zone Application Type"},null,{"$f":"VLOOKUP($G89,CleanCombi!$A$1:$H$1826,7,0)","v":"First Select Zone Application Type"},{"$nulls":3},"067",{"$nulls":3},"067"]
[{"$nulls":5},"7-8","PLEASE SELECT",{"$f":"VLOOKUP($G90,CleanCombi!$A$1:$H$1826,2,0)","v":"First Select Zone Application Type"},{"$nulls":3},{"$f":"VLOOKUP($G90,CleanCombi!$A$1:$H$1826,4,0)","v":"First Select Zone Application Type"},null,null,{"$f":"VLOOKUP($G90,CleanCombi!$A$1:$H$1826,5,0)","v":"First Select Zone Application Type"},null,{"$f":"VLOOKUP($G90,CleanCombi!$A$1:$H$1826,7,0)","v":"First Select Zone Application Type"},{"$nulls":3},"068",{"$nulls":3},"068"]
[{"$nulls":4},"ClimateSync 8","8-1","PLEASE SELECT",{"$f":"VLOOKUP($G91,CleanCombi!$A$1:$H$1826,2,0)","v":"First Select Zone Application Type"},{"$nulls":3},{"$f":"VLOOKUP($G91,CleanCombi!$A$1:$H$1826,4,0)","v":"First Select Zone Application Type"},null,null,{"$f":"VLOOKUP($G91,CleanCombi!$A$1:$H$1826,5,0)","v":"First Select Zone Application Type"},null,{"$f":"VLOOKUP($G91,CleanCombi!$A$1:$H$1826,7,0)","v":"First Select Zone Application Type"},{"$nulls":3},"071",{"$nulls":3},"071"]
[{"$nulls":5},"8-2","PLEASE SELECT",{"$f":"VLOOKUP($G92,CleanCombi!$A$1:$H$1826,2,0)","v":"First Select Zone Application Type"},{"$nulls":3},{"$f":"VLOOKUP($G92,CleanCombi!$A$1:$H$1826,4,0)","v":"First Select Zone Application Type"},null,null,{"$f":"VLOOKUP($G92,CleanCombi!$A$1:$H$1826,5,0)","v":"First Select Zone Application Type"},null,{"$f":"VLOOKUP($G92,CleanCombi!$A$1:$H$1826,7,0)","v":"First Select Zone Application Type"},{"$nulls":3},"072",{"$nulls":3},"072"]
[{"$nulls":5},"8-3","PLEASE SELECT",{"$f":"VLOOKUP($G93,CleanCombi!$A$1:$H$1826,2,0)","v":"First Select Zone Application Type"},{"$nulls":3},{"$f":"VLOOKUP($G93,CleanCombi!$A$1:$H$1826,4,0)","v":"First Select Zone Application Type"},null,null,{"$f":"VLOOKUP($G93,CleanCombi!$A$1:$H$1826,5,0)","v":"First Select Zone Application Type"},null,{"$f":"VLOOKUP($G93,CleanCombi!$A$1:$H$1826,7,0)","v":"First Select Zone Application Type"},{"$nulls":3},"073",{"$nulls":3},"073"]
[{"$nulls":5},"8-4","PLEASE SELECT",{"$f":"VLOOKUP($G94,CleanCombi!$A$1:$H$1826,2,0)","v":"First Select Zone Application Type"},{"$nulls":3},{"$f":"VLOOKUP($G94,CleanCombi!$A$1:$H$1826,4,0)","v":"First Select Zone Application Type"},null,null,{"$f":"VLOOKUP($G94,CleanCombi!$A$1:$H$1826,5,0)","v":"First Select Zone Application Type"},null,{"$f":"VLOOKUP($G94,CleanCombi!$A$1:$H$1826,7,0)","v":"First Select Zone Application Type"},{"$nulls":3},"074",{"$nulls":3},"074"]
[{"$nulls":5},"8-5","PLEASE SELECT",{"$f":"VLOOKUP($G95,CleanCombi!$A$1:$H$1826,2,0)","v":"First Select Zone Application Type"},{"$nulls":3},{"$f":"VLOOKUP($G95,CleanCombi!$A$1:$H$1826,4,0)","v":"First Select Zone Application Type"},null,null,{"$f":"VLOOKUP($G95,CleanCombi!$A$1:$H$1826,5,0)","v":"First Select Zone Application Type"},null,{"$f":"VLOOKUP($G95,CleanCombi!$A$1:$H$1826,7,0)","v":"First Select Zone Application Type"},{"$nulls":3},"075",{"$nulls":3},"075"]
[{"$nulls":5},"8-6","PLEASE SELECT",{"$f":"VLOOKUP($G96,CleanCombi!$A$1:$H$1826,2,0)","v":"First Select Zone Application Type"},{"$nulls":3},{"$f":"VLOOKUP($G96,CleanCombi!$A$1:$H$1826,4,0)","v":"First Select Zone Application Type"},null,null,{"$f":"VLOOKUP($G96,CleanCombi!$A$1:$H$1826,5,0)","v":"First Select Zone Application Type"},null,{"$f":"VLOOKUP($G96,CleanCombi!$A$1:$H$1826,7,0)","v":"First Select Zone Application Type"},{"$nulls":3},"076",{"$nulls":3},"076"]
[{"$nulls":5},"8-7","PLEASE SELECT",{"$f":"VLOOKUP($G97,CleanCombi!$A$1:$H$1826,2,0)","v":"First Select Zone Application Type"},{"$nulls":3},{"$f":"VLOOKUP($G97,CleanCombi!$A$1:$H$1826,4,0)","v":"First Select Zone Application Type"},null,null,{"$f":"VLOOKUP($G97,CleanCombi!$A$1:$H$1826,5,0)","v":"First Select Zone Application Type"},null,{"$f":"VLOOKUP($G97,CleanCombi!$A$1:$H$1826,7,0)","v":"First Select Zone Application Type"},{"$nulls":3},"077",{"$nulls":3},"077"]
[{"$nulls":5},"8-8","PLEASE SELECT",{"$f":"VLOOKUP($G98,CleanCombi!$A$1:$H$1826,2,0)","v":"First Select Zone Application Type"},{"$nulls":3},{"$f":"VLOOKUP($G98,CleanCombi!$A$1:$H$1826,4,0)","v":"First Select Zone Application Type"},null,null,{"$f":"VLOOKUP($G98,CleanCombi!$A$1:$H$1826,5,0)","v":"First Select Zone Application Type"},null,{"$f":"VLOOKUP($G98,CleanCombi!$A$1:$H$1826,7,0)","v":"First Select Zone Application Type"},{"$nulls":3},"078",{"$nulls":3},"078"]
[{"$nulls":4},"ClimateSync 9","9-1","PLEASE SELECT",{"$f":"VLOOKUP($G99,CleanCombi!$A$1:$H$1826,2,0)","v":"First Select Zone Application Type"},{"$nulls":3},{"$f":"VLOOKUP($G99,CleanCombi!$A$1:$H$1826,4,0)","v":"First Select Zone Application Type"},null,null,{"$f":"VLOOKUP($G99,CleanCombi!$A$1:$H$1826,5,0)","v":"First Select Zone Application Type"},null,{"$f":"VLOOKUP($G99,CleanCombi!$A$1:$H$1826,7,0)","v":"First Select Zone Application Type"},{"$nulls":3},"081",{"$nulls":3},"081"]
[{"$nulls":5},"9-2","PLEASE SELECT",{"$f":"VLOOKUP($G100,CleanCombi!$A$1:$H$1826,2,0)","v":"First Select Zone Application Type"},{"$nulls":3},{"$f":"VLOOKUP($G100,CleanCombi!$A$1:$H$1826,4,0)","v":"First Select Zone Application Type"},null,null,{"$f":"VLOOKUP($G100,CleanCombi!$A$1:$H$1826,5,0)","v":"First Select Zone Application Type"},null,{"$f":"VLOOKUP($G100,CleanCombi!$A$1:$H$1826,7,0)","v":"First Select Zone Application Type"},{"$nulls":3},"082",{"$nulls":3},{"$f":"U100","v":"082"}]
[{"$nulls":5},"9-3","PLEASE SELECT",{"$f":"VLOOKUP($G101,CleanCombi!$A$1:$H$1826,2,0)","v":"First Select Zone Application Type"},{"$nulls":3},{"$f":"VLOOKUP($G101,CleanCombi!$A$1:$H$1826,4,0)","v":"First Select Zone Application Type"},null,null,{"$f":"VLOOKUP($G101,CleanCombi!$A$1:$H$1826,5,0)","v":"First Select Zone Application Type"},null,{"$f":"VLOOKUP($G101,CleanCombi!$A$1:$H$1826,7,0)","v":"First Select Zone Application Type"},{"$nulls":3},"083",{"$nulls":3},"083"]
[{"$nulls":5},"9-4","PLEASE SELECT",{"$f":"VLOOKUP($G102,CleanCombi!$A$1:$H$1826,2,0)","v":"First Select Zone Application Type"},{"$nulls":3},{"$f":"VLOOKUP($G102,CleanCombi!$A$1:$H$1826,4,0)","v":"First Select Zone Application Type"},null,null,{"$f":"VLOOKUP($G102,CleanCombi!$A$1:$H$1826,5,0)","v":"First Select Zone Application Type"},null,{"$f":"VLOOKUP($G102,CleanCombi!$A$1:$H$1826,7,0)","v":"First Select Zone Application Type"},{"$nulls":3},"084",{"$nulls":3},"084"]
[{"$nulls":5},"9-5","PLEASE SELECT",{"$f":"VLOOKUP($G103,CleanCombi!$A$1:$H$1826,2,0)","v":"First Select Zone Application Type"},{"$nulls":3},{"$f":"VLOOKUP($G103,CleanCombi!$A$1:$H$1826,4,0)","v":"First Select Zone Application Type"},null,null,{"$f":"VLOOKUP($G103,CleanCombi!$A$1:$H$1826,5,0)","v":"First Select Zone Application Type"},null,{"$f":"VLOOKUP($G103,CleanCombi!$A$1:$H$1826,7,0)","v":"First Select Zone Application Type"},{"$nulls":3},"085",{"$nulls":3},"085"]
[{"$nulls":5},"9-6","PLEASE SELECT",{"$f":"VLOOKUP($G104,CleanCombi!$A$1:$H$1826,2,0)","v":"First Select Zone Application Type"},{"$nulls":3},{"$f":"VLOOKUP($G104,CleanCombi!$A$1:$H$1826,4,0)","v":"First Select Zone Application Type"},null,null,{"$f":"VLOOKUP($G104,CleanCombi!$A$1:$H$1826,5,0)","v":"First Select Zone Application Type"},null,{"$f":"VLOOKUP($G104,CleanCombi!$A$1:$H$1826,7,0)","v":"First Select Zone Application Type"},{"$nulls":3},"086",{"$nulls":3},"086"]
[{"$nulls":5},"9-7","PLEASE SELECT",{"$f":"VLOOKUP($G105,CleanCombi!$A$1:$H$1826,2,0)","v":"First Select Zone Application Type"},{"$nulls":3},{"$f":"VLOOKUP($G105,CleanCombi!$A$1:$H$1826,4,0)","v":"First Select Zone Application Type"},null,null,{"$f":"VLOOKUP($G105,CleanCombi!$A$1:$H$1826,5,0)","v":"First Select Zone Application Type"},null,{"$f":"VLOOKUP($G105,CleanCombi!$A$1:$H$1826,7,0)","v":"First Select Zone Application Type"},{"$nulls":3},"087",{"$nulls":3},"087"]
[{"$nulls":5},"9-8","PLEASE SELECT",{"$f":"VLOOKUP($G106,CleanCombi!$A$1:$H$1826,2,0)","v":"First Select Zone Application Type"},{"$nulls":3},{"$f":"VLOOKUP($G106,CleanCombi!$A$1:$H$1826,4,0)","v":"First Select Zone Application Type"},null,null,{"$f":"VLOOKUP($G106,CleanCombi!$A$1:$H$1826,5,0)","v":"First Select Zone Application Type"},null,{"$f":"VLOOKUP($G106,CleanCombi!$A$1:$H$1826,7,0)","v":"First Select Zone Application Type"},{"$nulls":3},"088",{"$nulls":3},"088"]
[{"$nulls":4},"ClimateSync 10","10-1","PLEASE SELECT",{"$f":"VLOOKUP($G107,CleanCombi!$A$1:$H$1826,2,0)","v":"First Select Zone Application Type"},{"$nulls":3},{"$f":"VLOOKUP($G107,CleanCombi!$A$1:$H$1826,4,0)","v":"First Select Zone Application Type"},null,null,{"$f":"VLOOKUP($G107,CleanCombi!$A$1:$H$1826,5,0)","v":"First Select Zone Application Type"},null,{"$f":"VLOOKUP($G107,CleanCombi!$A$1:$H$1826,7,0)","v":"First Select Zone Application Type"},{"$nulls":3},"091",{"$nulls":3},"091"]
[{"$nulls":5},"10-2","PLEASE SELECT",{"$f":"VLOOKUP($G108,CleanCombi!$A$1:$H$1826,2,0)","v":"First Select Zone Application Type"},{"$nulls":3},{"$f":"VLOOKUP($G108,CleanCombi!$A$1:$H$1826,4,0)","v":"First Select Zone Application Type"},null,null,{"$f":"VLOOKUP($G108,CleanCombi!$A$1:$H$1826,5,0)","v":"First Select Zone Application Type"},null,{"$f":"VLOOKUP($G108,CleanCombi!$A$1:$H$1826,7,0)","v":"First Select Zone Application Type"},{"$nulls":3},"092",{"$nulls":3},"092"]
[{"$nulls":5},"10-3","PLEASE SELECT",{"$f":"VLOOKUP($G109,CleanCombi!$A$1:$H$1826,2,0)","v":"First Select Zone Application Type"},{"$nulls":3},{"$f":"VLOOKUP($G109,CleanCombi!$A$1:$H$1826,4,0)","v":"First Select Zone Application Type"},null,null,{"$f":"VLOOKUP($G109,CleanCombi!$A$1:$H$1826,5,0)","v":"First Select Zone Application Type"},null,{"$f":"VLOOKUP($G109,CleanCombi!$A$1:$H$1826,7,0)","v":"First Select Zone Application Type"},{"$nulls":3},"093",{"$nulls":3},"093"]
[{"$nulls":5},"10-4","PLEASE SELECT",{"$f":"VLOOKUP($G110,CleanCombi!$A$1:$H$1826,2,0)","v":"First Select Zone Application Type"},{"$nulls":3},{"$f":"VLOOKUP($G110,CleanCombi!$A$1:$H$1826,4,0)","v":"First Select Zone Application Type"},null,null,{"$f":"VLOOKUP($G110,CleanCombi!$A$1:$H$1826,5,0)","v":"First Select Zone Application Type"},null,{"$f":"VLOOKUP($G110,CleanCombi!$A$1:$H$1826,7,0)","v":"First Select Zone Application Type"},{"$nulls":3},"094",{"$nulls":3},"094"]
[{"$nulls":5},"10-5","PLEASE SELECT",{"$f":"VLOOKUP($G111,CleanCombi!$A$1:$H$1826,2,0)","v":"First Select Zone Application Type"},{"$nulls":3},{"$f":"VLOOKUP($G111,CleanCombi!$A$1:$H$1826,4,0)","v":"First Select Zone Application Type"},null,null,{"$f":"VLOOKUP($G111,CleanCombi!$A$1:$H$1826,5,0)","v":"First Select Zone Application Type"},null,{"$f":"VLOOKUP($G111,CleanCombi!$A$1:$H$1826,7,0)","v":"First Select Zone Application Type"},{"$nulls":3},"095",{"$nulls":3},"095"]
[{"$nulls":5},"10-6","PLEASE SELECT",{"$f":"VLOOKUP($G112,CleanCombi!$A$1:$H$1826,2,0)","v":"First Select Zone Application Type"},{"$nulls":3},{"$f":"VLOOKUP($G112,CleanCombi!$A$1:$H$1826,4,0)","v":"First Select Zone Application Type"},null,null,{"$f":"VLOOKUP($G112,CleanCombi!$A$1:$H$1826,5,0)","v":"First Select Zone Application Type"},null,{"$f":"VLOOKUP($G112,CleanCombi!$A$1:$H$1826,7,0)","v":"First Select Zone Application Type"},{"$nulls":3},"096",{"$nulls":3},"096"]
[{"$nulls":5},"10-7","PLEASE SELECT",{"$f":"VLOOKUP($G113,CleanCombi!$A$1:$H$1826,2,0)","v":"First Select Zone Application Type"},{"$nulls":3},{"$f":"VLOOKUP($G113,CleanCombi!$A$1:$H$1826,4,0)","v":"First Select Zone Application Type"},null,null,{"$f":"VLOOKUP($G113,CleanCombi!$A$1:$H$1826,5,0)","v":"First Select Zone Application Type"},null,{"$f":"VLOOKUP($G113,CleanCombi!$A$1:$H$1826,7,0)","v":"First Select Zone Application Type"},{"$nulls":3},"097",{"$nulls":3},"097"]
[{"$nulls":5},"10-8","PLEASE SELECT",{"$f":"VLOOKUP($G114,CleanCombi!$A$1:$H$1826,2,0)","v":"First Select Zone Application Type"},{"$nulls":3},{"$f":"VLOOKUP($G114,CleanCombi!$A$1:$H$1826,4,0)","v":"First Select Zone Application Type"},null,null,{"$f":"VLOOKUP($G114,CleanCombi!$A$1:$H$1826,5,0)","v":"First Select Zone Application Type"},null,{"$f":"VLOOKUP($G114,CleanCombi!$A$1:$H$1826,7,0)","v":"First Select Zone Application Type"},{"$nulls":3},"098",{"$nulls":3},"098"]
[{"$nulls":4},"ClimateSync 11","11-1","PLEASE SELECT",{"$f":"VLOOKUP($G115,CleanCombi!$A$1:$H$1826,2,0)","v":"First Select Zone Application Type"},{"$nulls":3},{"$f":"VLOOKUP($G115,CleanCombi!$A$1:$H$1826,4,0)","v":"First Select Zone Application Type"},null,null,{"$f":"VLOOKUP($G115,CleanCombi!$A$1:$H$1826,5,0)","v":"First Select Zone Application Type"},null,{"$f":"VLOOKUP($G115,CleanCombi!$A$1:$H$1826,7,0)","v":"First Select Zone Application Type"},{"$nulls":3},101,{"$nulls":3},101]
[{"$nulls":5},"11-2","PLEASE SELECT",{"$f":"VLOOKUP($G116,CleanCombi!$A$1:$H$1826,2,0)","v":"First Select Zone Application Type"},{"$nulls":3},{"$f":"VLOOKUP($G116,CleanCombi!$A$1:$H$1826,4,0)","v":"First Select Zone Application Type"},null,null,{"$f":"VLOOKUP($G116,CleanCombi!$A$1:$H$1826,5,0)","v":"First Select Zone Application Type"},null,{"$f":"VLOOKUP($G116,CleanCombi!$A$1:$H$1826,7,0)","v":"First Select Zone Application Type"},{"$nulls":3},102,{"$nulls":3},102]
[{"$nulls":5},"11-3","PLEASE SELECT",{"$f":"VLOOKUP($G117,CleanCombi!$A$1:$H$1826,2,0)","v":"First Select Zone Application Type"},{"$nulls":3},{"$f":"VLOOKUP($G117,CleanCombi!$A$1:$H$1826,4,0)","v":"First Select Zone Application Type"},null,null,{"$f":"VLOOKUP($G117,CleanCombi!$A$1:$H$1826,5,0)","v":"First Select Zone Application Type"},null,{"$f":"VLOOKUP($G117,CleanCombi!$A$1:$H$1826,7,0)","v":"First Select Zone Application Type"},{"$nulls":3},103,{"$nulls":3},103]
[{"$nulls":5},"11-4","PLEASE SELECT",{"$f":"VLOOKUP($G118,CleanCombi!$A$1:$H$1826,2,0)","v":"First Select Zone Application Type"},{"$nulls":3},{"$f":"VLOOKUP($G118,CleanCombi!$A$1:$H$1826,4,0)","v":"First Select Zone Application Type"},null,null,{"$f":"VLOOKUP($G118,CleanCombi!$A$1:$H$1826,5,0)","v":"First Select Zone Application Type"},null,{"$f":"VLOOKUP($G118,CleanCombi!$A$1:$H$1826,7,0)","v":"First Select Zone Application Type"},{"$nulls":3},104,{"$nulls":3},104]
[{"$nulls":5},"11-5","PLEASE SELECT",{"$f":"VLOOKUP($G119,CleanCombi!$A$1:$H$1826,2,0)","v":"First Select Zone Application Type"},{"$nulls":3},{"$f":"VLOOKUP($G119,CleanCombi!$A$1:$H$1826,4,0)","v":"First Select Zone Application Type"},null,null,{"$f":"VLOOKUP($G119,CleanCombi!$A$1:$H$1826,5,0)","v":"First Select Zone Application Type"},null,{"$f":"VLOOKUP($G119,CleanCombi!$A$1:$H$1826,7,0)","v":"First Select Zone Application Type"},{"$nulls":3},105,{"$nulls":3},105]
[{"$nulls":5},"11-6","PLEASE SELECT",{"$f":"VLOOKUP($G120,CleanCombi!$A$1:$H$1826,2,0)","v":"First Select Zone Application Type"},{"$nulls":3},{"$f":"VLOOKUP($G120,CleanCombi!$A$1:$H$1826,4,0)","v":"First Select Zone Application Type"},null,null,{"$f":"VLOOKUP($G120,CleanCombi!$A$1:$H$1826,5,0)","v":"First Select Zone Application Type"},null,{"$f":"VLOOKUP($G120,CleanCombi!$A$1:$H$1826,7,0)","v":"First Select Zone Application Type"},{"$nulls":3},106,{"$nulls":3},106]
[{"$nulls":5},"11-7","PLEASE SELECT",{"$f":"VLOOKUP($G121,CleanCombi!$A$1:$H$1826,2,0)","v":"First Select Zone Application Type"},{"$nulls":3},{"$f":"VLOOKUP($G121,CleanCombi!$A$1:$H$1826,4,0)","v":"First Select Zone Application Type"},null,null,{"$f":"VLOOKUP($G121,CleanCombi!$A$1:$H$1826,5,0)","v":"First Select Zone Application Type"},null,{"$f":"VLOOKUP($G121,CleanCombi!$A$1:$H$1826,7,0)","v":"First Select Zone Application Type"},{"$nulls":3},107,{"$nulls":3},107]
[{"$nulls":5},"11-8","PLEASE SELECT",{"$f":"VLOOKUP($G122,CleanCombi!$A$1:$H$1826,2,0)","v":"First Select Zone Application Type"},{"$nulls":3},{"$f":"VLOOKUP($G122,CleanCombi!$A$1:$H$1826,4,0)","v":"First Select Zone Application Type"},null,null,{"$f":"VLOOKUP($G122,CleanCombi!$A$1:$H$1826,5,0)","v":"First Select Zone Application Type"},null,{"$f":"VLOOKUP($G122,CleanCombi!$A$1:$H$1826,7,0)","v":"First Select Zone Application Type"},{"$nulls":3},108,{"$nulls":3},108]
[{"$nulls":4},"ClimateSync 12","12-1","PLEASE SELECT",{"$f":"VLOOKUP($G123,CleanCombi!$A$1:$H$1826,2,0)","v":"First Select Zone Application Type"},{"$nulls":3},{"$f":"VLOOKUP($G123,CleanCombi!$A$1:$H$1826,4,0)","v":"First Select Zone Application Type"},null,null,{"$f":"VLOOKUP($G123,CleanCombi!$A$1:$H$1826,5,0)","v":"First Select Zone Application Type"},null,{"$f":"VLOOKUP($G123,CleanCombi!$A$1:$H$1826,7,0)","v":"First Select Zone Application Type"},{"$nulls":3},111,{"$nulls":3},111]
[{"$nulls":5},"12-2","PLEASE SELECT",{"$f":"VLOOKUP($G124,CleanCombi!$A$1:$H$1826,2,0)","v":"First Select Zone Application Type"},{"$nulls":3},{"$f":"VLOOKUP($G124,CleanCombi!$A$1:$H$1826,4,0)","v":"First Select Zone Application Type"},null,null,{"$f":"VLOOKUP($G124,CleanCombi!$A$1:$H$1826,5,0)","v":"First Select Zone Application Type"},null,{"$f":"VLOOKUP($G124,CleanCombi!$A$1:$H$1826,7,0)","v":"First Select Zone Application Type"},{"$nulls":3},112,{"$nulls":3},112]
[{"$nulls":5},"12-3","PLEASE SELECT",{"$f":"VLOOKUP($G125,CleanCombi!$A$1:$H$1826,2,0)","v":"First Select Zone Application Type"},{"$nulls":3},{"$f":"VLOOKUP($G125,CleanCombi!$A$1:$H$1826,4,0)","v":"First Select Zone Application Type"},null,null,{"$f":"VLOOKUP($G125,CleanCombi!$A$1:$H$1826,5,0)","v":"First Select Zone Application Type"},null,{"$f":"VLOOKUP($G125,CleanCombi!$A$1:$H$1826,7,0)","v":"First Select Zone Application Type"},{"$nulls":3},113,{"$nulls":3},113]
[{"$nulls":5},"12-4","PLEASE SELECT",{"$f":"VLOOKUP($G126,CleanCombi!$A$1:$H$1826,2,0)","v":"First Select Zone Application Type"},{"$nulls":3},{"$f":"VLOOKUP($G126,CleanCombi!$A$1:$H$1826,4,0)","v":"First Select Zone Application Type"},null,null,{"$f":"VLOOKUP($G126,CleanCombi!$A$1:$H$1826,5,0)","v":"First Select Zone Application Type"},null,{"$f":"VLOOKUP($G126,CleanCombi!$A$1:$H$1826,7,0)","v":"First Select Zone Application Type"},{"$nulls":3},114,{"$nulls":3},114]
[{"$nulls":5},"12-5","PLEASE SELECT",{"$f":"VLOOKUP($G127,CleanCombi!$A$1:$H$1826,2,0)","v":"First Select Zone Application Type"},{"$nulls":3},{"$f":"VLOOKUP($G127,CleanCombi!$A$1:$H$1826,4,0)","v":"First Select Zone Application Type"},null,null,{"$f":"VLOOKUP($G127,CleanCombi!$A$1:$H$1826,5,0)","v":"First Select Zone Application Type"},null,{"$f":"VLOOKUP($G127,CleanCombi!$A$1:$H$1826,7,0)","v":"First Select Zone Application Type"},{"$nulls":3},115,{"$nulls":3},115]
[{"$nulls":5},"12-6","PLEASE SELECT",{"$f":"VLOOKUP($G128,CleanCombi!$A$1:$H$1826,2,0)","v":"First Select Zone Application Type"},{"$nulls":3},{"$f":"VLOOKUP($G128,CleanCombi!$A$1:$H$1826,4,0)","v":"First Select Zone Application Type"},null,null,{"$f":"VLOOKUP($G128,CleanCombi!$A$1:$H$1826,5,0)","v":"First Select Zone Application Type"},null,{"$f":"VLOOKUP($G128,CleanCombi!$A$1:$H$1826,7,0)","v":"First Select Zone Application Type"},{"$nulls":3},116,{"$nulls":3},116]
[{"$nulls":5},"12-7","PLEASE SELECT",{"$f":"VLOOKUP($G129,CleanCombi!$A$1:$H$1826,2,0)","v":"First Select Zone Application Type"},{"$nulls":3},{"$f":"VLOOKUP($G129,CleanCombi!$A$1:$H$1826,4,0)","v":"First Select Zone Application Type"},null,null,{"$f":"VLOOKUP($G129,CleanCombi!$A$1:$H$1826,5,0)","v":"First Select Zone Application Type"},null,{"$f":"VLOOKUP($G129,CleanCombi!$A$1:$H$1826,7,0)","v":"First Select Zone Application Type"},{"$nulls":3},117,{"$nulls":3},117]
[{"$nulls":5},"12-8","PLEASE SELECT",{"$f":"VLOOKUP($G130,CleanCombi!$A$1:$H$1826,2,0)","v":"First Select Zone Application Type"},{"$nulls":3},{"$f":"VLOOKUP($G130,CleanCombi!$A$1:$H$1826,4,0)","v":"First Select Zone Application Type"},null,null,{"$f":"VLOOKUP($G130,CleanCombi!$A$1:$H$1826,5,0)","v":"First Select Zone Application Type"},null,{"$f":"VLOOKUP($G130,CleanCombi!$A$1:$H$1826,7,0)","v":"First Select Zone Application Type"},{"$nulls":3},118,{"$nulls":3},118]
[{"$nulls":4},"ClimateSync 13","13-1","PLEASE SELECT",{"$f":"VLOOKUP($G131,CleanCombi!$A$1:$H$1826,2,0)","v":"First Select Zone Application Type"},{"$nulls":3},{"$f":"VLOOKUP($G131,CleanCombi!$A$1:$H$1826,4,0)","v":"First Select Zone Application Type"},null,null,{"$f":"VLOOKUP($G131,CleanCombi!$A$1:$H$1826,5,0)","v":"First Select Zone Application Type"},null,{"$f":"VLOOKUP($G131,CleanCombi!$A$1:$H$1826,7,0)","v":"First Select Zone Application Type"},{"$nulls":3},121,{"$nulls":3},121]
[{"$nulls":5},"13-2","PLEASE SELECT",{"$f":"VLOOKUP($G132,CleanCombi!$A$1:$H$1826,2,0)","v":"First Select Zone Application Type"},{"$nulls":3},{"$f":"VLOOKUP($G132,CleanCombi!$A$1:$H$1826,4,0)","v":"First Select Zone Application Type"},null,null,{"$f":"VLOOKUP($G132,CleanCombi!$A$1:$H$1826,5,0)","v":"First Select Zone Application Type"},null,{"$f":"VLOOKUP($G132,CleanCombi!$A$1:$H$1826,7,0)","v":"First Select Zone Application Type"},{"$nulls":3},122,{"$nulls":3},122]
[{"$nulls":5},"13-3","PLEASE SELECT",{"$f":"VLOOKUP($G133,CleanCombi!$A$1:$H$1826,2,0)","v":"First Select Zone Application Type"},{"$nulls":3},{"$f":"VLOOKUP($G133,CleanCombi!$A$1:$H$1826,4,0)","v":"First Select Zone Application Type"},null,null,{"$f":"VLOOKUP($G133,CleanCombi!$A$1:$H$1826,5,0)","v":"First Select Zone Application Type"},null,{"$f":"VLOOKUP($G133,CleanCombi!$A$1:$H$1826,7,0)","v":"First Select Zone Application Type"},{"$nulls":3},123,{"$nulls":3},123]
[{"$nulls":5},"13-4","PLEASE SELECT",{"$f":"VLOOKUP($G134,CleanCombi!$A$1:$H$1826,2,0)","v":"First Select Zone Application Type"},{"$nulls":3},{"$f":"VLOOKUP($G134,CleanCombi!$A$1:$H$1826,4,0)","v":"First Select Zone Application Type"},null,null,{"$f":"VLOOKUP($G134,CleanCombi!$A$1:$H$1826,5,0)","v":"First Select Zone Application Type"},null,{"$f":"VLOOKUP($G134,CleanCombi!$A$1:$H$1826,7,0)","v":"First Select Zone Application Type"},{"$nulls":3},124,{"$nulls":3},124]
[{"$nulls":5},"13-5","PLEASE SELECT",{"$f":"VLOOKUP($G135,CleanCombi!$A$1:$H$1826,2,0)","v":"First Select Zone Application Type"},{"$nulls":3},{"$f":"VLOOKUP($G135,CleanCombi!$A$1:$H$1826,4,0)","v":"First Select Zone Application Type"},null,null,{"$f":"VLOOKUP($G135,CleanCombi!$A$1:$H$1826,5,0)","v":"First Select Zone Application Type"},null,{"$f":"VLOOKUP($G135,CleanCombi!$A$1:$H$1826,7,0)","v":"First Select Zone Application Type"},{"$nulls":3},125,{"$nulls":3},125]
[{"$nulls":5},"13-6","PLEASE SELECT",{"$f":"VLOOKUP($G136,CleanCombi!$A$1:$H$1826,2,0)","v":"First Select Zone Application Type"},{"$nulls":3},{"$f":"VLOOKUP($G136,CleanCombi!$A$1:$H$1826,4,0)","v":"First Select Zone Application Type"},null,null,{"$f":"VLOOKUP($G136,CleanCombi!$A$1:$H$1826,5,0)","v":"First Select Zone Application Type"},null,{"$f":"VLOOKUP($G136,CleanCombi!$A$1:$H$1826,7,0)","v":"First Select Zone Application Type"},{"$nulls":3},126,{"$nulls":3},126]
[{"$nulls":5},"13-7","PLEASE SELECT",{"$f":"VLOOKUP($G137,CleanCombi!$A$1:$H$1826,2,0)","v":"First Select Zone Application Type"},{"$nulls":3},{"$f":"VLOOKUP($G137,CleanCombi!$A$1:$H$1826,4,0)","v":"First Select Zone Application Type"},null,null,{"$f":"VLOOKUP($G137,CleanCombi!$A$1:$H$1826,5,0)","v":"First Select Zone Application Type"},null,{"$f":"VLOOKUP($G137,CleanCombi!$A$1:$H$1826,7,0)","v":"First Select Zone Application Type"},{"$nulls":3},127,{"$nulls":3},127]
[{"$nulls":5},"13-8","PLEASE SELECT",{"$f":"VLOOKUP($G138,CleanCombi!$A$1:$H$1826,2,0)","v":"First Select Zone Application Type"},{"$nulls":3},{"$f":"VLOOKUP($G138,CleanCombi!$A$1:$H$1826,4,0)","v":"First Select Zone Application Type"},null,null,{"$f":"VLOOKUP($G138,CleanCombi!$A$1:$H$1826,5,0)","v":"First Select Zone Application Type"},null,{"$f":"VLOOKUP($G138,CleanCombi!$A$1:$H$1826,7,0)","v":"First Select Zone Application Type"},{"$nulls":3},128,{"$nulls":3},128]
[{"$nulls":4},"ClimateSync 14","14-1","PLEASE SELECT",{"$f":"VLOOKUP($G139,CleanCombi!$A$1:$H$1826,2,0)","v":"First Select Zone Application Type"},{"$nulls":3},{"$f":"VLOOKUP($G139,CleanCombi!$A$1:$H$1826,4,0)","v":"First Select Zone Application Type"},null,null,{"$f":"VLOOKUP($G139,CleanCombi!$A$1:$H$1826,5,0)","v":"First Select Zone Application Type"},null,{"$f":"VLOOKUP($G139,CleanCombi!$A$1:$H$1826,7,0)","v":"First Select Zone Application Type"},{"$nulls":3},131,{"$nulls":3},131]
[{"$nulls":5},"14-2","PLEASE SELECT",{"$f":"VLOOKUP($G140,CleanCombi!$A$1:$H$1826,2,0)","v":"First Select Zone Application Type"},{"$nulls":3},{"$f":"VLOOKUP($G140,CleanCombi!$A$1:$H$1826,4,0)","v":"First Select Zone Application Type"},null,null,{"$f":"VLOOKUP($G140,CleanCombi!$A$1:$H$1826,5,0)","v":"First Select Zone Application Type"},null,{"$f":"VLOOKUP($G140,CleanCombi!$A$1:$H$1826,7,0)","v":"First Select Zone Application Type"},{"$nulls":3},132,{"$nulls":3},132]
[{"$nulls":5},"14-3","PLEASE SELECT",{"$f":"VLOOKUP($G141,CleanCombi!$A$1:$H$1826,2,0)","v":"First Select Zone Application Type"},{"$nulls":3},{"$f":"VLOOKUP($G141,CleanCombi!$A$1:$H$1826,4,0)","v":"First Select Zone Application Type"},null,null,{"$f":"VLOOKUP($G141,CleanCombi!$A$1:$H$1826,5,0)","v":"First Select Zone Application Type"},null,{"$f":"VLOOKUP($G141,CleanCombi!$A$1:$H$1826,7,0)","v":"First Select Zone Application Type"},{"$nulls":3},133,{"$nulls":3},133]
[{"$nulls":5},"14-4","PLEASE SELECT",{"$f":"VLOOKUP($G142,CleanCombi!$A$1:$H$1826,2,0)","v":"First Select Zone Application Type"},{"$nulls":3},{"$f":"VLOOKUP($G142,CleanCombi!$A$1:$H$1826,4,0)","v":"First Select Zone Application Type"},null,null,{"$f":"VLOOKUP($G142,CleanCombi!$A$1:$H$1826,5,0)","v":"First Select Zone Application Type"},null,{"$f":"VLOOKUP($G142,CleanCombi!$A$1:$H$1826,7,0)","v":"First Select Zone Application Type"},{"$nulls":3},134,{"$nulls":3},134]
[{"$nulls":5},"14-5","PLEASE SELECT",{"$f":"VLOOKUP($G143,CleanCombi!$A$1:$H$1826,2,0)","v":"First Select Zone Application Type"},{"$nulls":3},{"$f":"VLOOKUP($G143,CleanCombi!$A$1:$H$1826,4,0)","v":"First Select Zone Application Type"},null,null,{"$f":"VLOOKUP($G143,CleanCombi!$A$1:$H$1826,5,0)","v":"First Select Zone Application Type"},null,{"$f":"VLOOKUP($G143,CleanCombi!$A$1:$H$1826,7,0)","v":"First Select Zone Application Type"},{"$nulls":3},135,{"$nulls":3},135]
[{"$nulls":5},"14-6","PLEASE SELECT",{"$f":"VLOOKUP($G144,CleanCombi!$A$1:$H$1826,2,0)","v":"First Select Zone Application Type"},{"$nulls":3},{"$f":"VLOOKUP($G144,CleanCombi!$A$1:$H$1826,4,0)","v":"First Select Zone Application Type"},null,null,{"$f":"VLOOKUP($G144,CleanCombi!$A$1:$H$1826,5,0)","v":"First Select Zone Application Type"},null,{"$f":"VLOOKUP($G144,CleanCombi!$A$1:$H$1826,7,0)","v":"First Select Zone Application Type"},{"$nulls":3},136,{"$nulls":3},136]
[{"$nulls":5},"14-7","PLEASE SELECT",{"$f":"VLOOKUP($G145,CleanCombi!$A$1:$H$1826,2,0)","v":"First Select Zone Application Type"},{"$nulls":3},{"$f":"VLOOKUP($G145,CleanCombi!$A$1:$H$1826,4,0)","v":"First Select Zone Application Type"},null,null,{"$f":"VLOOKUP($G145,CleanCombi!$A$1:$H$1826,5,0)","v":"First Select Zone Application Type"},null,{"$f":"VLOOKUP($G145,CleanCombi!$A$1:$H$1826,7,0)","v":"First Select Zone Application Type"},{"$nulls":3},137,{"$nulls":3},137]
[{"$nulls":5},"14-8","PLEASE SELECT",{"$f":"VLOOKUP($G146,CleanCombi!$A$1:$H$1826,2,0)","v":"First Select Zone Application Type"},{"$nulls":3},{"$f":"VLOOKUP($G146,CleanCombi!$A$1:$H$1826,4,0)","v":"First Select Zone Application Type"},null,null,{"$f":"VLOOKUP($G146,CleanCombi!$A$1:$H$1826,5,0)","v":"First Select Zone Application Type"},null,{"$f":"VLOOKUP($G146,CleanCombi!$A$1:$H$1826,7,0)","v":"First Select Zone Application Type"},{"$nulls":3},138,{"$nulls":3},138]
[{"$nulls":4},"ClimateSync 15","15-1","PLEASE SELECT",{"$f":"VLOOKUP($G147,CleanCombi!$A$1:$H$1826,2,0)","v":"First Select Zone Application Type"},{"$nulls":3},{"$f":"VLOOKUP($G147,CleanCombi!$A$1:$H$1826,4,0)","v":"First Select Zone Application Type"},null,null,{"$f":"VLOOKUP($G147,CleanCombi!$A$1:$H$1826,5,0)","v":"First Select Zone Application Type"},null,{"$f":"VLOOKUP($G147,CleanCombi!$A$1:$H$1826,7,0)","v":"First Select Zone Application Type"},{"$nulls":3},141,{"$nulls":3},141]
[{"$nulls":5},"15-2","PLEASE SELECT",{"$f":"VLOOKUP($G148,CleanCombi!$A$1:$H$1826,2,0)","v":"First Select Zone Application Type"},{"$nulls":3},{"$f":"VLOOKUP($G148,CleanCombi!$A$1:$H$1826,4,0)","v":"First Select Zone Application Type"},null,null,{"$f":"VLOOKUP($G148,CleanCombi!$A$1:$H$1826,5,0)","v":"First Select Zone Application Type"},null,{"$f":"VLOOKUP($G148,CleanCombi!$A$1:$H$1826,7,0)","v":"First Select Zone Application Type"},{"$nulls":3},142,{"$nulls":3},142]
[{"$nulls":5},"15-3","PLEASE SELECT",{"$f":"VLOOKUP($G149,CleanCombi!$A$1:$H$1826,2,0)","v":"First Select Zone Application Type"},{"$nulls":3},{"$f":"VLOOKUP($G149,CleanCombi!$A$1:$H$1826,4,0)","v":"First Select Zone Application Type"},null,null,{"$f":"VLOOKUP($G149,CleanCombi!$A$1:$H$1826,5,0)","v":"First Select Zone Application Type"},null,{"$f":"VLOOKUP($G149,CleanCombi!$A$1:$H$1826,7,0)","v":"First Select Zone Application Type"},{"$nulls":3},143,{"$nulls":3},143]
[{"$nulls":5},"15-4","PLEASE SELECT",{"$f":"VLOOKUP($G150,CleanCombi!$A$1:$H$1826,2,0)","v":"First Select Zone Application Type"},{"$nulls":3},{"$f":"VLOOKUP($G150,CleanCombi!$A$1:$H$1826,4,0)","v":"First Select Zone Application Type"},null,null,{"$f":"VLOOKUP($G150,CleanCombi!$A$1:$H$1826,5,0)","v":"First Select Zone Application Type"},null,{"$f":"VLOOKUP($G150,CleanCombi!$A$1:$H$1826,7,0)","v":"First Select Zone Application Type"},{"$nulls":3},144,{"$nulls":3},144]
[{"$nulls":5},"15-5","PLEASE SELECT",{"$f":"VLOOKUP($G151,CleanCombi!$A$1:$H$1826,2,0)","v":"First Select Zone Application Type"},{"$nulls":3},{"$f":"VLOOKUP($G151,CleanCombi!$A$1:$H$1826,4,0)","v":"First Select Zone Application Type"},null,null,{"$f":"VLOOKUP($G151,CleanCombi!$A$1:$H$1826,5,0)","v":"First Select Zone Application Type"},null,{"$f":"VLOOKUP($G151,CleanCombi!$A$1:$H$1826,7,0)","v":"First Select Zone Application Type"},{"$nulls":3},145,{"$nulls":3},145]
[{"$nulls":5},"15-6","PLEASE SELECT",{"$f":"VLOOKUP($G152,CleanCombi!$A$1:$H$1826,2,0)","v":"First Select Zone Application Type"},{"$nulls":3},{"$f":"VLOOKUP($G152,CleanCombi!$A$1:$H$1826,4,0)","v":"First Select Zone Application Type"},null,null,{"$f":"VLOOKUP($G152,CleanCombi!$A$1:$H$1826,5,0)","v":"First Select Zone Application Type"},null,{"$f":"VLOOKUP($G152,CleanCombi!$A$1:$H$1826,7,0)","v":"First Select Zone Application Type"},{"$nulls":3},146,{"$nulls":3},146]
[{"$nulls":5},"15-7","PLEASE SELECT",{"$f":"VLOOKUP($G153,CleanCombi!$A$1:$H$1826,2,0)","v":"First Select Zone Application Type"},{"$nulls":3},{"$f":"VLOOKUP($G153,CleanCombi!$A$1:$H$1826,4,0)","v":"First Select Zone Application Type"},null,null,{"$f":"VLOOKUP($G153,CleanCombi!$A$1:$H$1826,5,0)","v":"First Select Zone Application Type"},null,{"$f":"VLOOKUP($G153,CleanCombi!$A$1:$H$1826,7,0)","v":"First Select Zone Application Type"},{"$nulls":3},147,{"$nulls":3},147]
[{"$nulls":5},"15-8","PLEASE SELECT",{"$f":"VLOOKUP($G154,CleanCombi!$A$1:$H$1826,2,0)","v":"First Select Zone Application Type"},{"$nulls":3},{"$f":"VLOOKUP($G154,CleanCombi!$A$1:$H$1826,4,0)","v":"First Select Zone Application Type"},null,null,{"$f":"VLOOKUP($G154,CleanCombi!$A$1:$H$1826,5,0)","v":"First Select Zone Application Type"},null,{"$f":"VLOOKUP($G154,CleanCombi!$A$1:$H$1826,7,0)","v":"First Select Zone Application Type"},{"$nulls":3},148,{"$nulls":3},148]
[{"$nulls":4},"ClimateSync 16","16-1","PLEASE SELECT",{"$f":"VLOOKUP($G155,CleanCombi!$A$1:$H$1826,2,0)","v":"First Select Zone Application Type"},{"$nulls":3},{"$f":"VLOOKUP($G155,CleanCombi!$A$1:$H$1826,4,0)","v":"First Select Zone Application Type"},null,null,{"$f":"VLOOKUP($G155,CleanCombi!$A$1:$H$1826,5,0)","v":"First Select Zone Application Type"},null,{"$f":"VLOOKUP($G155,CleanCombi!$A$1:$H$1826,7,0)","v":"First Select Zone Application Type"},{"$nulls":3},151,{"$nulls":3},151]
[{"$nulls":5},"16-2","PLEASE SELECT",{"$f":"VLOOKUP($G156,CleanCombi!$A$1:$H$1826,2,0)","v":"First Select Zone Application Type"},{"$nulls":3},{"$f":"VLOOKUP($G156,CleanCombi!$A$1:$H$1826,4,0)","v":"First Select Zone Application Type"},null,null,{"$f":"VLOOKUP($G156,CleanCombi!$A$1:$H$1826,5,0)","v":"First Select Zone Application Type"},null,{"$f":"VLOOKUP($G156,CleanCombi!$A$1:$H$1826,7,0)","v":"First Select Zone Application Type"},{"$nulls":3},152,{"$nulls":3},152]
[{"$nulls":5},"16-3","PLEASE SELECT",{"$f":"VLOOKUP($G157,CleanCombi!$A$1:$H$1826,2,0)","v":"First Select Zone Application Type"},{"$nulls":3},{"$f":"VLOOKUP($G157,CleanCombi!$A$1:$H$1826,4,0)","v":"First Select Zone Application Type"},null,null,{"$f":"VLOOKUP($G157,CleanCombi!$A$1:$H$1826,5,0)","v":"First Select Zone Application Type"},null,{"$f":"VLOOKUP($G157,CleanCombi!$A$1:$H$1826,7,0)","v":"First Select Zone Application Type"},{"$nulls":3},153,{"$nulls":3},153]
[{"$nulls":5},"16-4","PLEASE SELECT",{"$f":"VLOOKUP($G158,CleanCombi!$A$1:$H$1826,2,0)","v":"First Select Zone Application Type"},{"$nulls":3},{"$f":"VLOOKUP($G158,CleanCombi!$A$1:$H$1826,4,0)","v":"First Select Zone Application Type"},null,null,{"$f":"VLOOKUP($G158,CleanCombi!$A$1:$H$1826,5,0)","v":"First Select Zone Application Type"},null,{"$f":"VLOOKUP($G158,CleanCombi!$A$1:$H$1826,7,0)","v":"First Select Zone Application Type"},{"$nulls":3},154,{"$nulls":3},154]
[{"$nulls":5},"16-5","PLEASE SELECT",{"$f":"VLOOKUP($G159,CleanCombi!$A$1:$H$1826,2,0)","v":"First Select Zone Application Type"},{"$nulls":3},{"$f":"VLOOKUP($G159,CleanCombi!$A$1:$H$1826,4,0)","v":"First Select Zone Application Type"},null,null,{"$f":"VLOOKUP($G159,CleanCombi!$A$1:$H$1826,5,0)","v":"First Select Zone Application Type"},null,{"$f":"VLOOKUP($G159,CleanCombi!$A$1:$H$1826,7,0)","v":"First Select Zone Application Type"},{"$nulls":3},155,{"$nulls":3},155]
[{"$nulls":5},"16-6","PLEASE SELECT",{"$f":"VLOOKUP($G160,CleanCombi!$A$1:$H$1826,2,0)","v":"First Select Zone Application Type"},{"$nulls":3},{"$f":"VLOOKUP($G160,CleanCombi!$A$1:$H$1826,4,0)","v":"First Select Zone Application Type"},null,null,{"$f":"VLOOKUP($G160,CleanCombi!$A$1:$H$1826,5,0)","v":"First Select Zone Application Type"},null,{"$f":"VLOOKUP($G160,CleanCombi!$A$1:$H$1826,7,0)","v":"First Select Zone Application Type"},{"$nulls":3},156,{"$nulls":3},156]
[{"$nulls":5},"16-7","PLEASE SELECT",{"$f":"VLOOKUP($G161,CleanCombi!$A$1:$H$1826,2,0)","v":"First Select Zone Application Type"},{"$nulls":3},{"$f":"VLOOKUP($G161,CleanCombi!$A$1:$H$1826,4,0)","v":"First Select Zone Application Type"},null,null,{"$f":"VLOOKUP($G161,CleanCombi!$A$1:$H$1826,5,0)","v":"First Select Zone Application Type"},null,{"$f":"VLOOKUP($G161,CleanCombi!$A$1:$H$1826,7,0)","v":"First Select Zone Application Type"},{"$nulls":3},157,{"$nulls":3},157]
[{"$nulls":5},"16-8","PLEASE SELECT",{"$f":"VLOOKUP($G162,CleanCombi!$A$1:$H$1826,2,0)","v":"First Select Zone Application Type"},{"$nulls":3},{"$f":"VLOOKUP($G162,CleanCombi!$A$1:$H$1826,4,0)","v":"First Select Zone Application Type"},null,null,{"$f":"VLOOKUP($G162,CleanCombi!$A$1:$H$1826,5,0)","v":"First Select Zone Application Type"},null,{"$f":"VLOOKUP($G162,CleanCombi!$A$1:$H$1826,7,0)","v":"First Select Zone Application Type"},{"$nulls":3},158,{"$nulls":3},158]