{"text_format":"3","workbook":"xlsx","n_sheets":3,"sheets":["NamedRanges","Config","ZoneTypes"],"not_rendered":{"macros":1,"defined_names":12},"read":"whole","date_system":"1900"}

{"sheet":"NamedRanges","index":0,"n_rows":33,"n_cols":12,"rows_kept":33,"hidden":true}
["ApplicationTypes","ACBrands","FloorLimits","NAList","Sensors_AC","Sensors_NoAC_UFH","Sensors_FloorProbe","Sensors_WiredCtrl","Sensors_ClimateSync","CylinderProbe","Sensors_None","SelectList"]
["PLEASE SELECT","PLEASE SELECT","PLEASE SELECT","N/A","PLEASE SELECT","PLEASE SELECT","Floor Probe","Wired Controller","ClimateSync Room Sensor","Cylinder Probe","N/A","PLEASE SELECT"]
["A","Daikin","TBA",null,"Room Thimble Sensor","Room Thimble Sensor"]
["B","Mitsubishi Electric","25 °C",null,"AC Unit","Wired Controller"]
["C","Mitsubishi Heavy","26 °C",null,"Wired Controller"]
["D","Toshiba","27 °C"]
["E","Sanyo","28 °C"]
["F","Panasonic","29 °C"]
["G","Samsung","30 °C"]
["H","Fujitsu","31 °C"]
["I","Hitachi","32 °C"]
["J","LG","33 °C"]
["K","Other","34 °C"]
["L",null,"35 °C"]
["M",null,"36 °C"]
["N",null,"37 °C"]
["O",null,"38 °C"]
["P",null,"39 °C"]
["Q",null,"40 °C"]
["R"]
["S"]
["FA"]
["FB"]
["FC"]
["FD"]
["FE"]
["FF"]
["FAB"]
["FBB"]
["FCB"]
["FDB"]
["FEB"]
["FFB"]

{"sheet":"Config","index":1,"n_rows":33,"n_cols":8,"rows_kept":33,"hidden":true}
["ZoneAppType","ZoneType","BrandList","UFHType","FloorProtReq","TempLimitList","TempControlled","SensorList"]
["PLEASE SELECT","First Select Zone Application Type","SelectList","First Select Zone Application Type","First Select Zone Application Type","SelectList","First Select Zone Application Type","SelectList"]
["A","Heating + Air Con","ACBrands","WET UFH","NO","NAList","Room Temp","Sensors_AC"]
["B","Heating + Air Con","ACBrands","WET UFH","YES","FloorLimits","Room Temp","Sensors_AC"]
["C","Heating + Air Con","ACBrands","ELECTRIC UFH","NO","NAList","Room Temp","Sensors_AC"]
["D","Heating + Air Con","ACBrands","ELECTRIC UFH","YES","FloorLimits","Room Temp","Sensors_AC"]
["E","Heating + Air Con","ACBrands","RADIATOR","N/A","NAList","Room Temp","Sensors_AC"]
["F","AC only","ACBrands","N/A","N/A","NAList","Room Temp","Sensors_AC"]
["G","Heating","NAList","WET UFH","NO","NAList","Room Temp","Sensors_NoAC_UFH"]
["H","Heating","NAList","WET UFH","YES","FloorLimits","Room Temp","Sensors_NoAC_UFH"]
["I","Heating","NAList","WET UFH","NO","NAList","Floor Temp","Sensors_FloorProbe"]
["J","Heating","NAList","ELECTRIC UFH","NO","NAList","Room Temp","Sensors_NoAC_UFH"]
["K","Heating","NAList","ELECTRIC UFH","YES","FloorLimits","Room Temp","Sensors_NoAC_UFH"]
["L","Heating","NAList","ELECTRIC UFH","NO","NAList","Floor Temp","Sensors_FloorProbe"]
["M","Heating","NAList","RADIATOR","N/A","NAList","Room Temp","Sensors_NoAC_UFH"]
["N","ON/OFF SWITCH","NAList","N/A","N/A","NAList","ON/OFF Only","Sensors_None"]
["O","Towel Rad ON/OFF Only","NAList","N/A","N/A","NAList","ON/OFF Only","Sensors_None"]
["P","Towel Rad Temp Control","NAList","RADIATOR","N/A","NAList","Room Temp","Sensors_NoAC_UFH"]
["Q","Hot Water ON/OFF","NAList","N/A","N/A","NAList","ON/OFF Only","Sensors_None"]
["R","Hot Water, Temp Control (Valve Only)","NAList","N/A","N/A","NAList","Cylinder Temp","CylinderProbe"]
["S","Hot Water, Temp Control (Valve & Boiler)","NAList","N/A","N/A","NAList","Cylinder Temp","CylinderProbe"]
["FA","Heating + FCU","ACBrands","WET UFH","NO","NAList","Room Temp","Sensors_WiredCtrl"]
["FB","Heating + FCU","ACBrands","WET UFH","YES","FloorLimits","Room Temp","Sensors_WiredCtrl"]
["FC","Heating + FCU","ACBrands","ELECTRIC UFH","NO","NAList","Room Temp","Sensors_WiredCtrl"]
["FD","Heating + FCU","ACBrands","ELECTRIC UFH","YES","FloorLimits","Room Temp","Sensors_WiredCtrl"]
["FE","Heating + FCU","ACBrands","RADIATOR","N/A","NAList","Room Temp","Sensors_WiredCtrl"]
["FF","FCU only","ACBrands","N/A","N/A","NAList","Room Temp","Sensors_WiredCtrl"]
["FAB","Heating + FCU","ACBrands","WET UFH","NO","NAList","Room Temp","Sensors_ClimateSync"]
["FBB","Heating + FCU","ACBrands","WET UFH","YES","FloorLimits","Room Temp","Sensors_ClimateSync"]
["FCB","Heating + FCU","ACBrands","ELECTRIC UFH","NO","NAList","Room Temp","Sensors_ClimateSync"]
["FDB","Heating + FCU","ACBrands","ELECTRIC UFH","YES","FloorLimits","Room Temp","Sensors_ClimateSync"]
["FEB","Heating + FCU","ACBrands","RADIATOR","N/A","NAList","Room Temp","Sensors_ClimateSync"]
["FFB","FCU only","ACBrands","N/A","N/A","NAList","Room Temp","Sensors_ClimateSync"]

{"sheet":"ZoneTypes","index":2,"n_rows":169,"n_cols":25,"rows_kept":169,"merged":[[7,20,7,24],[9,0,27,0],[40,0,40,24],[41,4,48,4],[49,4,56,4],[57,4,64,4],[65,4,72,4],[73,4,80,4],[81,4,88,4],[89,4,96,4],[97,4,104,4],[105,4,112,4],[113,4,120,4],[121,4,128,4],[129,4,136,4],[137,4,144,4],[145,4,152,4],[153,4,160,4],[161,4,168,4]]}
["Pruduced By"]
["Company/Business:","Insert text here"]
["Business Address:","Insert text here"]
["Telephone:","Insert text here"]
["Email:","Insert text here"]
["Website:","Insert text here"]
[]
["Client","Insert text here","Site / Project:","Insert text here",{"$nulls":16},"Commissioning Section"]
["Plot","Floor","Room","UFH Manifold","CS","CH-8 Wiring Centre Zone ID","Zone Application Type","Zone Type","Air Con Brand","Air Con Model","FCU Reference","UFH Type","UFH Zone Reference","Floor Finish (Optional)"," Floor Temperature Protection Limit Required","Floor Temperature Limit °C","Temperature to be Controlled","Zone Temp Sensor","Wired Controller","Notes","ClimateSync Zone Address","CooLinkHub Virtual Zone Address","AC Central Address","CMN Line"," Address for Automation Zone Driver"]
["Examples of Application Combinations Available","Ground","Lounge","M1",null,"1-1","A","Heating + Air Con","PLEASE SELECT",null,null,"WET UFH",null,null,"NO","N/A","Room Temp","PLEASE SELECT"]
[null,"1st","Master Bedroom","M2",null,"1-1","B","Heating + Air Con","PLEASE SELECT",null,null,"WET UFH",null,null,"YES","PLEASE SELECT","Room Temp","PLEASE SELECT"]
[null,"1st","Master EnSuite","M3",null,"1-1","C","Heating + Air Con","PLEASE SELECT",null,null,"ELECTRIC UFH",null,null,"NO","N/A","Room Temp","PLEASE SELECT"]
[{"$nulls":6},"D","Heating + Air Con","PLEASE SELECT",null,null,"ELECTRIC UFH",null,null,"YES","PLEASE SELECT","Room Temp","PLEASE SELECT"]
[{"$nulls":6},"E","Heating + Air Con","PLEASE SELECT",null,null,"RADIATOR",null,null,"N/A","N/A","Room Temp","PLEASE SELECT"]
[{"$nulls":6},"F","AC only","PLEASE SELECT",null,null,"N/A",null,null,"N/A","N/A","Room Temp","PLEASE SELECT"]
[{"$nulls":6},"G","Heating","N/A",null,null,"WET UFH",null,null,"NO","N/A","Room Temp","PLEASE SELECT"]
[{"$nulls":6},"H","Heating","N/A",null,null,"WET UFH",null,null,"YES","PLEASE SELECT","Room Temp","PLEASE SELECT"]
[{"$nulls":6},"I","Heating","N/A",null,null,"WET UFH",null,null,"NO","N/A","Floor Temp","Floor Probe"]
[{"$nulls":6},"J","Heating","N/A",null,null,"ELECTRIC UFH",null,null,"NO","N/A","Room Temp","PLEASE SELECT"]
[{"$nulls":6},"K","Heating","N/A",null,null,"ELECTRIC UFH",null,null,"YES","PLEASE SELECT","Room Temp","PLEASE SELECT"]
[{"$nulls":6},"L","Heating","N/A",null,null,"ELECTRIC UFH",null,null,"NO","N/A","Floor Temp","Floor Probe"]
[{"$nulls":6},"M","Heating","N/A",null,null,"RADIATOR",null,null,"N/A","N/A","Room Temp","PLEASE SELECT"]
[{"$nulls":6},"N","ON/OFF SWITCH","N/A",null,null,"N/A",null,null,"N/A","N/A","ON/OFF Only","N/A"]
[{"$nulls":6},"O","Towel Rad ON/OFF Only","N/A",null,null,"N/A",null,null,"N/A","N/A","ON/OFF Only","N/A"]
[{"$nulls":6},"P","Towel Rad Temp Control","N/A",null,null,"RADIATOR",null,null,"N/A","N/A","Room Temp","PLEASE SELECT"]
[{"$nulls":6},"Q","Hot Water ON/OFF","N/A",null,null,"N/A",null,null,"N/A","N/A","ON/OFF Only","N/A"]
[{"$nulls":6},"R","Hot Water, Temp Control (Valve Only)","N/A",null,null,"N/A",null,null,"N/A","N/A","Cylinder Temp","Cylinder Probe"]
[{"$nulls":6},"S","Hot Water, Temp Control (Valve & Boiler)","N/A",null,null,"N/A",null,null,"N/A","N/A","Cylinder Temp","Cylinder Probe"]
[{"$nulls":6},"FA","Heating + FCU","PLEASE SELECT",null,null,"WET UFH",null,null,"NO","N/A","Room Temp","Wired Controller"]
[{"$nulls":6},"FB","Heating + FCU","PLEASE SELECT",null,null,"WET UFH",null,null,"YES","PLEASE SELECT","Room Temp","Wired Controller"]
[{"$nulls":6},"FC","Heating + FCU","PLEASE SELECT",null,null,"ELECTRIC UFH",null,null,"NO","N/A","Room Temp","Wired Controller"]
[{"$nulls":6},"FD","Heating + FCU","PLEASE SELECT",null,null,"ELECTRIC UFH",null,null,"YES","PLEASE SELECT","Room Temp","Wired Controller"]
[{"$nulls":6},"FE","Heating + FCU","PLEASE SELECT",null,null,"RADIATOR",null,null,"N/A","N/A","Room Temp","Wired Controller"]
[{"$nulls":6},"FF","FCU Only","PLEASE SELECT",null,null,"N/A",null,null,"N/A","N/A","Room Temp","Wired Controller"]
[{"$nulls":6},"FAB","Heating + FCU","PLEASE SELECT",null,null,"WET UFH",null,null,"NO","N/A","Room Temp","ClimateSync Room Sensor"]
[{"$nulls":6},"FBB","Heating + FCU","PLEASE SELECT",null,null,"WET UFH",null,null,"YES","PLEASE SELECT","Room Temp","ClimateSync Room Sensor"]
[{"$nulls":6},"FCB","Heating + FCU","PLEASE SELECT",null,null,"ELECTRIC UFH",null,null,"NO","N/A","Room Temp","ClimateSync Room Sensor"]
[{"$nulls":6},"FDB","Heating + FCU","PLEASE SELECT",null,null,"ELECTRIC UFH",null,null,"YES","PLEASE SELECT","Room Temp","ClimateSync Room Sensor"]
[{"$nulls":6},"FEB","Heating + FCU","PLEASE SELECT",null,null,"RADIATOR",null,null,"N/A","N/A","Room Temp","ClimateSync Room Sensor"]
[{"$nulls":6},"FFB","FCU Only","PLEASE SELECT",null,null,"N/A",null,null,"N/A","N/A","Room Temp","ClimateSync Room Sensor"]
["1. Please Enable Macros.     2. Please add your project below this line.     3. Start by selecting the Zone Application Type."]
[{"$nulls":4},"ClimateSync 1","1-1","PLEASE SELECT",{"$f":"INDEX(Config!$B:$B, MATCH($G42, Config!$A:$A, 0))","v":"First Select Zone Application Type"},{"$nulls":3},{"$f":"INDEX(Config!$D:$D, MATCH($G42, Config!$A:$A, 0))","v":"First Select Zone Application Type"},null,null,{"$f":"INDEX(Config!$E:$E, MATCH($G42, Config!$A:$A, 0))","v":"First Select Zone Application Type"},null,{"$f":"INDEX(Config!$G:$G, MATCH($G42, Config!$A:$A, 0))","v":"First Select Zone Application Type"},{"$nulls":3},"001",{"$nulls":3},"001"]
[{"$nulls":5},"1-2","PLEASE SELECT",{"$f":"INDEX(Config!$B:$B, MATCH($G43, Config!$A:$A, 0))","v":"First Select Zone Application Type"},{"$nulls":3},{"$f":"INDEX(Config!$D:$D, MATCH($G43, Config!$A:$A, 0))","v":"First Select Zone Application Type"},null,null,{"$f":"INDEX(Config!$E:$E, MATCH($G43, Config!$A:$A, 0))","v":"First Select Zone Application Type"},null,{"$f":"INDEX(Config!$G:$G, MATCH($G43, Config!$A:$A, 0))","v":"First Select Zone Application Type"},{"$nulls":3},"002",{"$nulls":3},"002"]
[{"$nulls":5},"1-3","PLEASE SELECT",{"$f":"INDEX(Config!$B:$B, MATCH($G44, Config!$A:$A, 0))","v":"First Select Zone Application Type"},{"$nulls":3},{"$f":"INDEX(Config!$D:$D, MATCH($G44, Config!$A:$A, 0))","v":"First Select Zone Application Type"},null,null,{"$f":"INDEX(Config!$E:$E, MATCH($G44, Config!$A:$A, 0))","v":"First Select Zone Application Type"},null,{"$f":"INDEX(Config!$G:$G, MATCH($G44, Config!$A:$A, 0))","v":"First Select Zone Application Type"},{"$nulls":3},"003",{"$nulls":3},"003"]
[{"$nulls":5},"1-4","PLEASE SELECT",{"$f":"INDEX(Config!$B:$B, MATCH($G45, Config!$A:$A, 0))","v":"First Select Zone Application Type"},{"$nulls":3},{"$f":"INDEX(Config!$D:$D, MATCH($G45, Config!$A:$A, 0))","v":"First Select Zone Application Type"},null,null,{"$f":"INDEX(Config!$E:$E, MATCH($G45, Config!$A:$A, 0))","v":"First Select Zone Application Type"},null,{"$f":"INDEX(Config!$G:$G, MATCH($G45, Config!$A:$A, 0))","v":"First Select Zone Application Type"},{"$nulls":3},"004",{"$nulls":3},"004"]
[{"$nulls":5},"1-5","PLEASE SELECT",{"$f":"INDEX(Config!$B:$B, MATCH($G46, Config!$A:$A, 0))","v":"First Select Zone Application Type"},{"$nulls":3},{"$f":"INDEX(Config!$D:$D, MATCH($G46, Config!$A:$A, 0))","v":"First Select Zone Application Type"},null,null,{"$f":"INDEX(Config!$E:$E, MATCH($G46, Config!$A:$A, 0))","v":"First Select Zone Application Type"},null,{"$f":"INDEX(Config!$G:$G, MATCH($G46, Config!$A:$A, 0))","v":"First Select Zone Application Type"},{"$nulls":3},"005",{"$nulls":3},"005"]
[{"$nulls":5},"1-6","PLEASE SELECT",{"$f":"INDEX(Config!$B:$B, MATCH($G47, Config!$A:$A, 0))","v":"First Select Zone Application Type"},{"$nulls":3},{"$f":"INDEX(Config!$D:$D, MATCH($G47, Config!$A:$A, 0))","v":"First Select Zone Application Type"},null,null,{"$f":"INDEX(Config!$E:$E, MATCH($G47, Config!$A:$A, 0))","v":"First Select Zone Application Type"},null,{"$f":"INDEX(Config!$G:$G, MATCH($G47, Config!$A:$A, 0))","v":"First Select Zone Application Type"},{"$nulls":3},"006",{"$nulls":3},"006"]
[{"$nulls":5},"1-7","PLEASE SELECT",{"$f":"INDEX(Config!$B:$B, MATCH($G48, Config!$A:$A, 0))","v":"First Select Zone Application Type"},{"$nulls":3},{"$f":"INDEX(Config!$D:$D, MATCH($G48, Config!$A:$A, 0))","v":"First Select Zone Application Type"},null,null,{"$f":"INDEX(Config!$E:$E, MATCH($G48, Config!$A:$A, 0))","v":"First Select Zone Application Type"},null,{"$f":"INDEX(Config!$G:$G, MATCH($G48, Config!$A:$A, 0))","v":"First Select Zone Application Type"},{"$nulls":3},"007",{"$nulls":3},"007"]
[{"$nulls":5},"1-8","PLEASE SELECT",{"$f":"INDEX(Config!$B:$B, MATCH($G49, Config!$A:$A, 0))","v":"First Select Zone Application Type"},{"$nulls":3},{"$f":"INDEX(Config!$D:$D, MATCH($G49, Config!$A:$A, 0))","v":"First Select Zone Application Type"},null,null,{"$f":"INDEX(Config!$E:$E, MATCH($G49, Config!$A:$A, 0))","v":"First Select Zone Application Type"},null,{"$f":"INDEX(Config!$G:$G, MATCH($G49, Config!$A:$A, 0))","v":"First Select Zone Application Type"},{"$nulls":3},"008",{"$nulls":3},"008"]
[{"$nulls":4},"ClimateSync 2","2-1","PLEASE SELECT",{"$f":"INDEX(Config!$B:$B, MATCH($G50, Config!$A:$A, 0))","v":"First Select Zone Application Type"},{"$nulls":3},{"$f":"INDEX(Config!$D:$D, MATCH($G50, Config!$A:$A, 0))","v":"First Select Zone Application Type"},null,null,{"$f":"INDEX(Config!$E:$E, MATCH($G50, Config!$A:$A, 0))","v":"First Select Zone Application Type"},null,{"$f":"INDEX(Config!$G:$G, MATCH($G50, Config!$A:$A, 0))","v":"First Select Zone Application Type"},{"$nulls":3},"011",{"$nulls":3},"011"]
[{"$nulls":5},"2-2","PLEASE SELECT",{"$f":"INDEX(Config!$B:$B, MATCH($G51, Config!$A:$A, 0))","v":"First Select Zone Application Type"},{"$nulls":3},{"$f":"INDEX(Config!$D:$D, MATCH($G51, Config!$A:$A, 0))","v":"First Select Zone Application Type"},null,null,{"$f":"INDEX(Config!$E:$E, MATCH($G51, Config!$A:$A, 0))","v":"First Select Zone Application Type"},null,{"$f":"INDEX(Config!$G:$G, MATCH($G51, Config!$A:$A, 0))","v":"First Select Zone Application Type"},{"$nulls":3},"012",{"$nulls":3},"012"]
[{"$nulls":5},"2-3","PLEASE SELECT",{"$f":"INDEX(Config!$B:$B, MATCH($G52, Config!$A:$A, 0))","v":"First Select Zone Application Type"},{"$nulls":3},{"$f":"INDEX(Config!$D:$D, MATCH($G52, Config!$A:$A, 0))","v":"First Select Zone Application Type"},null,null,{"$f":"INDEX(Config!$E:$E, MATCH($G52, Config!$A:$A, 0))","v":"First Select Zone Application Type"},null,{"$f":"INDEX(Config!$G:$G, MATCH($G52, Config!$A:$A, 0))","v":"First Select Zone Application Type"},{"$nulls":3},"013",{"$nulls":3},"013"]
[{"$nulls":5},"2-4","PLEASE SELECT",{"$f":"INDEX(Config!$B:$B, MATCH($G53, Config!$A:$A, 0))","v":"First Select Zone Application Type"},{"$nulls":3},{"$f":"INDEX(Config!$D:$D, MATCH($G53, Config!$A:$A, 0))","v":"First Select Zone Application Type"},null,null,{"$f":"INDEX(Config!$E:$E, MATCH($G53, Config!$A:$A, 0))","v":"First Select Zone Application Type"},null,{"$f":"INDEX(Config!$G:$G, MATCH($G53, Config!$A:$A, 0))","v":"First Select Zone Application Type"},{"$nulls":3},"014",{"$nulls":3},"014"]
[{"$nulls":5},"2-5","PLEASE SELECT",{"$f":"INDEX(Config!$B:$B, MATCH($G54, Config!$A:$A, 0))","v":"First Select Zone Application Type"},{"$nulls":3},{"$f":"INDEX(Config!$D:$D, MATCH($G54, Config!$A:$A, 0))","v":"First Select Zone Application Type"},null,null,{"$f":"INDEX(Config!$E:$E, MATCH($G54, Config!$A:$A, 0))","v":"First Select Zone Application Type"},null,{"$f":"INDEX(Config!$G:$G, MATCH($G54, Config!$A:$A, 0))","v":"First Select Zone Application Type"},{"$nulls":3},"015",{"$nulls":3},"015"]
[{"$nulls":5},"2-6","PLEASE SELECT",{"$f":"INDEX(Config!$B:$B, MATCH($G55, Config!$A:$A, 0))","v":"First Select Zone Application Type"},{"$nulls":3},{"$f":"INDEX(Config!$D:$D, MATCH($G55, Config!$A:$A, 0))","v":"First Select Zone Application Type"},null,null,{"$f":"INDEX(Config!$E:$E, MATCH($G55, Config!$A:$A, 0))","v":"First Select Zone Application Type"},null,{"$f":"INDEX(Config!$G:$G, MATCH($G55, Config!$A:$A, 0))","v":"First Select Zone Application Type"},{"$nulls":3},"016",{"$nulls":3},"016"]
[{"$nulls":5},"2-7","PLEASE SELECT",{"$f":"INDEX(Config!$B:$B, MATCH($G56, Config!$A:$A, 0))","v":"First Select Zone Application Type"},{"$nulls":3},{"$f":"INDEX(Config!$D:$D, MATCH($G56, Config!$A:$A, 0))","v":"First Select Zone Application Type"},null,null,{"$f":"INDEX(Config!$E:$E, MATCH($G56, Config!$A:$A, 0))","v":"First Select Zone Application Type"},null,{"$f":"INDEX(Config!$G:$G, MATCH($G56, Config!$A:$A, 0))","v":"First Select Zone Application Type"},{"$nulls":3},"017",{"$nulls":3},"017"]
[{"$nulls":5},"2-8","PLEASE SELECT",{"$f":"INDEX(Config!$B:$B, MATCH($G57, Config!$A:$A, 0))","v":"First Select Zone Application Type"},{"$nulls":3},{"$f":"INDEX(Config!$D:$D, MATCH($G57, Config!$A:$A, 0))","v":"First Select Zone Application Type"},null,null,{"$f":"INDEX(Config!$E:$E, MATCH($G57, Config!$A:$A, 0))","v":"First Select Zone Application Type"},null,{"$f":"INDEX(Config!$G:$G, MATCH($G57, Config!$A:$A, 0))","v":"First Select Zone Application Type"},{"$nulls":3},"018",{"$nulls":3},"018"]
[{"$nulls":4},"ClimateSync 3","3-1","PLEASE SELECT",{"$f":"INDEX(Config!$B:$B, MATCH($G58, Config!$A:$A, 0))","v":"First Select Zone Application Type"},{"$nulls":3},{"$f":"INDEX(Config!$D:$D, MATCH($G58, Config!$A:$A, 0))","v":"First Select Zone Application Type"},null,null,{"$f":"INDEX(Config!$E:$E, MATCH($G58, Config!$A:$A, 0))","v":"First Select Zone Application Type"},null,{"$f":"INDEX(Config!$G:$G, MATCH($G58, Config!$A:$A, 0))","v":"First Select Zone Application Type"},{"$nulls":3},"021",{"$nulls":3},"021"]
[{"$nulls":5},"3-2","PLEASE SELECT",{"$f":"INDEX(Config!$B:$B, MATCH($G59, Config!$A:$A, 0))","v":"First Select Zone Application Type"},{"$nulls":3},{"$f":"INDEX(Config!$D:$D, MATCH($G59, Config!$A:$A, 0))","v":"First Select Zone Application Type"},null,null,{"$f":"INDEX(Config!$E:$E, MATCH($G59, Config!$A:$A, 0))","v":"First Select Zone Application Type"},null,{"$f":"INDEX(Config!$G:$G, MATCH($G59, Config!$A:$A, 0))","v":"First Select Zone Application Type"},{"$nulls":3},"022",{"$nulls":3},"022"]
[{"$nulls":5},"3-3","PLEASE SELECT",{"$f":"INDEX(Config!$B:$B, MATCH($G60, Config!$A:$A, 0))","v":"First Select Zone Application Type"},{"$nulls":3},{"$f":"INDEX(Config!$D:$D, MATCH($G60, Config!$A:$A, 0))","v":"First Select Zone Application Type"},null,null,{"$f":"INDEX(Config!$E:$E, MATCH($G60, Config!$A:$A, 0))","v":"First Select Zone Application Type"},null,{"$f":"INDEX(Config!$G:$G, MATCH($G60, Config!$A:$A, 0))","v":"First Select Zone Application Type"},{"$nulls":3},"023",{"$nulls":3},"023"]
{"$rows_left_out":109}